program: Gaussian 09
title: 000296019
version: EM64L-G09RevD.01
frameworkgroup: C1[X(C10H15NS)]
method: RPBEPBE
basis: SDD
operation: Freq
keyword: #p
keyword: freq=noraman
keyword: PBEPBE/SDD
title: #p freq=noraman PBEPBE/SDD
converged: YES YES NO NO
title: Mulliken charges:
elementType: S N C C C C C C C C C C H H H H H H H H H H H H H H H
charge: -0.048249 -0.104539 -0.489472 -0.264693 0.448630 -0.633623 -0.701325 -0.376622 -0.448142 -0.224855 -0.219752 -0.245614 0.227788 0.191715 0.199231 0.225580 0.218162 0.253487 0.193909 0.268173 0.258606 0.262689 0.232083 0.224275 0.224381 0.227108 0.101069
chargesum: 0.00000
title: Mulliken charges with hydrogens summed into heavy atoms:
elementType: S N C C C C C C C C C C
charge: 0.052820 -0.104539 -0.069970 0.160117 0.448630 0.031935 -0.174545 -0.113933 -0.216058 -0.000580 0.004630 -0.018506
polarizability: 1.83492010e+02 -1.05638325e+00 1.22070595e+02 6.44817412e+00 6.72652255e+00 7.87577887e+01
1716.lowfreq: -22.3200 0.0025 0.0027 0.0028 4.9493 8.1059 22.2791 35.6337 36.8779
frequency: 16.0707 34.6976 36.8577 88.7386 97.9243 112.5887 160.8265 199.7985 232.7376 249.0752 325.7198 342.2554 362.7802 406.2144 459.9650 495.4377 602.7763 616.6186 698.0595 705.6508 744.9636 784.8894 790.9560 809.1358 853.9671 858.8793 914.6124 978.3084 982.4478 990.0569 993.6332 999.3855 1023.1001 1029.9713 1078.7278 1081.3232 1106.7645 1122.6822 1167.0973 1169.6189 1179.9735 1209.4609 1235.1903 1260.7021 1265.6826 1306.0954 1315.1245 1340.8264 1377.1726 1390.7433 1431.7713 1442.5449 1452.0944 1459.8987 1472.3137 1477.0922 1481.9318 1484.0642 1595.0420 1614.4636 2440.6985 2847.8344 2870.1849 2880.6349 2992.1463 3032.2405 3037.3800 3040.5586 3091.9251 3113.0685 3116.9158 3123.0136 3136.1027 3147.3262 3161.8887
redmass: 2.0161 4.7029 4.0625 1.6869 2.8871 1.7688 4.4854 1.2043 3.1453 3.9593 3.2594 2.9260 2.0909 2.8365 3.1353 3.4793 4.8129 6.3284 4.4828 2.1274 1.5660 1.3268 1.3054 3.7395 2.3589 1.2627 1.3615 1.6304 1.4158 5.8304 1.4653 1.3964 2.2404 1.9875 1.5949 2.7275 1.2768 1.9801 1.4935 1.0624 1.1178 2.5731 1.5189 1.3453 1.5548 1.2997 1.3361 1.3809 2.0692 2.5061 1.2857 1.8077 1.0921 1.1183 1.0518 1.1079 1.5998 1.2648 6.1849 6.1426 1.0385 1.0703 1.0590 1.0669 1.0869 1.0797 1.0740 1.0650 1.1009 1.0869 1.1094 1.0862 1.0915 1.0955 1.1014
irintensity: 9.4060 6.3119 1.1837 13.5093 0.9494 5.1856 4.2672 1.9928 2.9260 0.3105 2.7478 2.4153 8.6068 0.4336 7.5956 4.4064 1.7712 0.2086 18.6774 40.3439 60.5371 9.0130 0.8239 14.8289 13.4334 0.0869 4.0625 7.6523 1.6077 0.2114 3.6724 4.2202 62.4130 28.4589 6.8626 16.7785 3.1496 16.8478 11.4587 0.6218 0.7763 2.5826 7.7291 19.6321 5.4622 3.9951 11.3921 13.1242 0.7711 3.7285 9.3384 13.6984 3.8515 7.0737 12.1650 9.0098 14.5846 10.6235 0.6764 6.4445 35.2481 64.0258 60.3416 150.4462 18.5371 12.3297 3.8147 56.4734 29.1113 8.6891 25.7188 0.1816 19.1621 33.7812 27.2142
temp: 298.150 k
press: 1.00000 atm
elementType: 16 7 6 6 6 6 6 6 6 6 6 6 1 1 1 1 1 1 1 1 1 1 1 1 1 1 1
symmnumber: 1
zpe: 589456.4 jmol-1
zpe.correction: 0.224512 hartree
zpe.thermalcorrener: 0.237885 hartree
zpe.thermalcorrenthalpy: 0.238829 hartree
zpe.thermalcorrgfe: 0.181687 hartree
zpe.sumelectzpe: -841.925166 hartree
zpe.sumelectthermal: -841.911793 hartree
zpe.sumelectthermalent: -841.910849 hartree
zpe.sumelectthermalfe: -841.967991 hartree
dipole: 0.9247 0.3368 0.8458
dipole: 1.2976
quadrupole: -83.7248 -74.7409 -83.6423
quadrupole: -6.0521 -2.5590 1.4315
quadrupole: -3.0222 5.9618 -2.9396 -6.0521 -2.5590 1.4315
hfenergy: -842.1496783 hartree
pointgroup: C01 [X(C10H15N1S1)]
dipole: 0.3604486 0.1604692 -0.3239926 debye
polarizability: 182.5811683|10.6958575|95.4505983|-3.8211104|21.7628426|106.2886268 unknown
InChI: InChI=1S/C10H15NS/c1-11(7-8-12)9-10-5-3-2-4-6-10/h2-6,12H,7-9H2,1H3
charge 0 multiplicity 1
27 atoms
S  -5.355626 -0.75226 0.072924
N  -1.341082 0.315715 -0.040237
C  -0.316596 0.285491 1.033091
C  -2.718574 0.080576 0.453816
C  1.104696 0.113619 0.501094
C  -1.225944 1.523654 -0.886224
C  -3.600261 -0.544736 -0.641869
C  1.369377 -0.7693 -0.576438
C  2.186913 0.795367 1.109103
C  2.690785 -0.969315 -1.032154
C  3.512407 0.592931 0.658764
C  3.768629 -0.291158 -0.41396
H  -0.557703 -0.573476 1.690927
H  -0.354491 1.200735 1.677875
H  -3.198605 1.019004 0.828417
H  -2.67105 -0.621763 1.3066
H  -1.941436 1.475658 -1.724564
H  -0.210559 1.581045 -1.313198
H  -1.419286 2.466622 -0.316473
H  -3.204493 -1.531642 -0.927579
H  -3.665137 0.10182 -1.531533
H  0.523659 -1.277468 -1.053124
H  1.992587 1.488918 1.9372
H  2.882571 -1.653178 -1.867167
H  4.340075 1.127314 1.139105
H  4.794271 -0.446822 -0.767286
H  -5.888225 -1.40605 -1.025211
