program: Gaussian 09
title: 000296016
version: EM64L-G09RevD.01
frameworkgroup: C1[X(C10H15N)]
method: RPBEPBE
basis: SDD
operation: Freq
keyword: #pfreq=noraman
keyword: PBEPBE/SDD
title: #p freq=noraman PBEPBE/SDD
converged: YES YES NO NO
title: Mulliken charges:
elementType: N C C C C C C C C C C H H H H H H H H H H H H H H H
charge: -0.346995 -0.197216 0.495148 -0.726897 -0.454094 -0.381907 0.435837 -0.415556 -0.361024 -0.638767 -0.809220 0.189102 0.235945 0.204038 0.231141 0.260796 0.228352 0.269642 0.224920 0.224349 0.245677 0.191219 0.216728 0.228162 0.221830 0.228791
chargesum: 0.00000
title: Mulliken charges with hydrogens summed into heavy atoms:
elementType: N C C C C C C C C C C
charge: -0.086199 -0.008114 0.495148 -0.055773 -0.225743 -0.112264 0.435837 -0.190636 -0.136675 0.014857 -0.130437
polarizability: 1.49629163e+02 4.59234613e+00 9.50110706e+01 -2.04819466e+00 1.45515459e+01 9.38461110e+01
1716.lowfreq: -34.9274 -6.4556 -0.0005 -0.0005 0.0004 8.7718 14.0777 45.7129 77.0637
frequency: -34.6937 45.6292 77.0612 127.8260 170.2335 197.0572 219.0253 229.9165 252.5041 337.4331 350.9524 408.6821 414.1769 453.3960 538.4870 553.7053 631.1011 645.5742 713.0838 733.1569 801.4932 829.9700 859.8716 890.7240 955.3374 978.7391 988.0515 992.9881 1013.5137 1047.2123 1050.1558 1072.0495 1108.8178 1114.8616 1154.0537 1166.3682 1184.3119 1218.9487 1234.1695 1289.1335 1306.1277 1329.4573 1379.4317 1383.0188 1395.6584 1406.3363 1434.9480 1446.9464 1464.2687 1469.7989 1471.8837 1475.0258 1476.3925 1496.8759 1507.3957 1587.0770 1624.7887 2830.8726 2876.9033 2974.2992 2974.7550 3023.8015 3052.0829 3070.2042 3080.4488 3082.0623 3098.1130 3103.4841 3111.0630 3130.1411 3143.4608 3462.6268
redmass: 1.0333 3.3773 3.1050 2.6717 1.6344 2.5293 1.2783 1.9489 1.6377 2.6905 3.4086 2.8762 3.4314 2.7801 2.4805 2.7064 3.2437 2.4253 2.9150 2.9853 4.4254 1.4342 1.2601 1.7180 1.3456 1.5660 1.4336 1.6683 2.8321 1.5509 1.4329 2.3453 1.3169 1.3207 3.7942 1.9913 1.1893 2.7272 1.9840 1.5495 1.2915 1.5561 1.2431 3.1093 1.2889 2.6294 1.1752 1.1888 1.0439 1.0462 1.0625 1.1119 1.1061 1.0702 2.4809 6.0781 6.4338 1.0813 1.0559 1.0372 1.0372 1.0742 1.0976 1.0973 1.1005 1.0986 1.0998 1.0871 1.0883 1.0958 1.0952 1.0749
irintensity: 0.4144 0.2626 1.4634 0.9328 2.3003 0.6199 1.9438 1.9042 2.0894 3.4337 1.4202 0.1687 5.3114 7.0385 46.9115 15.2653 30.5217 36.5004 5.9072 3.6333 0.1924 47.8922 2.7654 3.7032 1.5901 0.6653 0.5400 10.6243 6.0795 11.3800 13.1716 10.0555 4.6463 12.6227 45.4895 1.6543 2.0508 0.2641 6.4017 12.8725 6.7207 14.0204 17.9500 13.5957 7.3630 4.7242 10.7389 15.8698 1.0725 13.0366 18.5808 0.5096 10.6202 6.2580 31.5915 0.4419 0.9162 77.0589 140.5256 75.8340 9.8805 36.8794 23.7182 45.3862 38.2381 20.2572 22.3766 15.1747 19.5208 32.8216 5.8742 2.4157
temp: 298.150 k
press: 1.00000 atm
elementType: 7 6 6 6 6 6 6 6 6 6 6 1 1 1 1 1 1 1 1 1 1 1 1 1 1 1
symmnumber: 1
zpe: 590473.9 jmol-1
zpe.correction: 0.224900 hartree
zpe.thermalcorrener: 0.236014 hartree
zpe.thermalcorrenthalpy: 0.236958 hartree
zpe.thermalcorrgfe: 0.188045 hartree
zpe.sumelectzpe: -443.965864 hartree
zpe.sumelectthermal: -443.954750 hartree
zpe.sumelectthermalent: -443.953806 hartree
zpe.sumelectthermalfe: -444.002719 hartree
dipole: 0.6650 0.2598 0.4966
dipole: 0.8697
quadrupole: -57.1619 -67.1289 -67.5366
quadrupole: 1.1319 0.8356 2.3648
quadrupole: 6.7805 -3.1864 -3.5941 1.1319 0.8356 2.3648
hfenergy: -444.190764 hartree
pointgroup: C01 [X(C10H15N1)]
dipole: 0.2612719 -0.0987213 0.1976256 debye
dipolederiv: -0.3391655 0.101707 0.0271264 0.1552144 -0.6489657 0.0062985 0.1291722 -0.0038073 -0.5825008 0.5384606 -0.1909425 -0.1187584 -0.2622147 0.2665491 0.0070599 -0.1042586 0.0414566 0.4996664 0.1377809 0.0700138 0.0340859 0.1022106 -0.0861059 0.0129637 0.0481426 -0.0112471 -0.1232981 -0.0457564 -0.0253235 -0.0002513 0.05873 -0.081426 -0.0388987 0.0589539 -0.0651748 0.0290262 -0.0788823 -0.005379 0.0216343 0.0016886 -0.1534402 -0.0490454 0.0396349 -0.0461746 0.076994 -0.1268319 0.0023493 -0.0470788 -0.0107925 -0.130791 -0.0240368 -0.0813064 -0.0381201 0.0175208 0.3553842 0.0054302 0.0654705 -0.0121535 -0.0392126 0.0041208 0.1117517 0.0041097 -0.0423555 -0.1195612 0.0194929 -0.0608847 0.0389902 -0.1501613 -0.0497469 -0.1651018 -0.0585588 0.0356897 -0.1223951 -0.0086471 0.0310951 -0.0126937 -0.1677503 -0.0597763 0.1078965 -0.0558781 0.1056717 0.1256679 0.0405786 0.0810391 -0.1505403 0.4954635 -0.0477753 0.0576909 -0.0543167 0.2554426 -0.1199657 0.0000712 -0.0392856 0.0177778 0.0755554 -0.0002559 -0.1146697 -0.0051305 0.0691518 -0.0461242 0.0430656 -0.0014788 0.0363951 -0.0707554 0.1377811 -0.0217525 0.044811 -0.2377291 0.0918016 0.0206283 -0.0554703 0.0109234 0.0257103 0.0530554 -0.0272297 0.1386021 -0.0523339 -0.256087 -0.0617295 -0.0673076 -0.0551091 0.0509754 -0.0131535 -0.0550937 -0.001793 0.0889182 0.0525307 0.0591387 0.1085102 0.0576868 0.0376209 -0.0439728 0.0875585 -0.0950513 -0.0421911 -0.071164 -0.0748433 0.0290945 0.0025748 0.1358846 -0.0726661 -0.0754748 -0.1128022 0.2369878 0.0418092 0.0209587 -0.1061376 0.0163996 0.1299235 0.0444651 -0.0861397 0.0434384 -0.0731778 0.0862891 -0.0368965 0.0876185 -0.0385853 0.1328977 0.0265583 0.0864349 0.0248358 0.0067619 -0.0312114 -0.0328216 0.1144358 -0.0325145 0.1377527 0.0485624 0.1077883 0.0463856 -0.0335686 0.0264671 0.0150084 -0.0910072 0.0192791 0.1351836 0.0420433 -0.0949911 0.0451867 -0.0890309 -0.0992782 -0.1121832 -0.0698468 -0.0661889 0.046472 0.0106116 -0.0726971 0.0196475 0.0766088 0.0339306 0.060182 -0.0595648 0.0963803 -0.1683443 0.051508 -0.1279467 0.2164111 -0.1255263 -0.0086768 0.08869 0.1290733 0.0401783 0.0214596 -0.051447 0.1484508 -0.0860582 -0.0726745 -0.0090826 -0.0272121 -0.0292751 -0.0905362 -0.0041886 -0.112308 -0.0753779 -0.1238137 -0.0146503 0.008281 -0.0146257 0.041838 -0.0418374 0.0929413 0.0460037 0.1579868 0.0525597 -0.0886727 -0.0242204 0.0432892 -0.0246748 0.118737 -0.0832484 0.0720508 -0.0394223 0.0804823 0.0792697 unknown
polarizability: 149.8905385|2.2330885|79.946652|1.7214029|-2.9973121|108.6491543 unknown
InChI: InChI=1S/C10H15N/c1-8-4-6-10(7-5-8)9(2)11-3/h4-7,9,11H,1-3H3
charge 0 multiplicity 1
26 atoms
N  2.698638 -0.353696 -0.648998
C  1.952973 0.174779 0.515213
C  0.43834 0.070515 0.300143
C  2.366089 1.650616 0.742209
C  -0.427939 -0.212174 1.381457
C  -0.131461 0.313043 -0.975177
C  -2.406035 0.006853 -0.072399
C  -1.830276 -0.240579 1.198575
C  -1.529062 0.280056 -1.156731
C  2.624893 -1.814186 -0.838856
C  -3.912093 -0.024682 -0.276844
H  2.196545 -0.395745 1.449761
H  2.149571 2.24648 -0.162231
H  3.447978 1.728987 0.966506
H  1.806301 2.085715 1.587403
H  3.664219 -0.003201 -0.665818
H  -0.005157 -0.41522 2.374395
H  0.545991 0.5059 -1.815101
H  -2.484397 -0.463262 2.050837
H  -1.95143 0.467089 -2.152709
H  1.58086 -2.107774 -1.048599
H  2.967213 -2.405623 0.045731
H  3.237993 -2.106845 -1.709673
H  -4.201123 -0.780027 -1.031861
H  -4.441305 -0.266705 0.660997
H  -4.290127 0.951887 -0.63433
