program: Gaussian 09
title: 000027216
version: EM64L-G09RevD.01
frameworkgroup: C1[X(C14H23NO2)]
method: RPBEPBE
basis: SDD
operation: Freq
keyword: #p
keyword: freq=noraman
keyword: PBEPBE/SDD
title: #p freq=noraman PBEPBE/SDD
converged: NO YES NO NO
title: Mulliken charges:
elementType: O O N C C C C C C C C C C C C C C H H H H H H H H H H H H H H H H H H H H H H H
charge: -0.242160 -0.244356 -0.713357 -0.367901 -0.368558 -0.351997 -0.405680 -0.355945 -0.309170 -0.696195 0.226000 0.196338 -0.291735 -0.557836 0.552393 -0.475548 -0.538711 0.191586 0.191695 0.188021 0.187816 0.187088 0.186954 0.214248 0.214296 0.195463 0.195527 0.197539 0.197655 0.209545 0.215408 0.209509 0.246213 0.229409 0.212202 0.297807 0.301191 0.244290 0.215469 0.215485
chargesum: 0.00000
title: Mulliken charges with hydrogens summed into heavy atoms:
elementType: O O N C C C C C C C C C C C C C C
charge: -0.242160 -0.244356 -0.114359 0.015380 0.007279 0.022045 0.022864 0.035045 0.086024 -0.061733 0.226000 0.196338 -0.045522 -0.328427 0.552393 -0.263345 0.136534
polarizability: 2.41418507e+02 -8.20268941e+00 1.77025205e+02 4.82829228e-02 2.87261516e-03 1.04949608e+02
1716.lowfreq: -10.0644 -7.2500 -0.0008 0.0006 0.0007 5.8853 22.3604 30.0612 54.5025
frequency: 21.8466 30.0185 54.3879 56.4107 85.9631 96.0433 100.8169 112.3343 139.8422 154.0946 154.9250 161.4098 190.0944 193.1842 223.9053 227.4118 264.1999 269.3327 310.4511 320.5138 356.1961 362.1027 369.2529 418.1298 453.3009 469.3191 509.6450 528.6655 592.5164 620.2456 709.6646 719.0917 725.0863 739.0788 766.4752 776.5698 785.3134 829.2465 844.0318 888.3212 894.3178 924.0198 924.3601 970.8161 998.5939 1004.4743 1007.2765 1033.7020 1040.9489 1061.1445 1080.4798 1088.9619 1109.0660 1124.8448 1126.4543 1149.5230 1153.9830 1181.9426 1191.8497 1217.4476 1228.7349 1234.9073 1275.0882 1275.7028 1278.1377 1281.2161 1293.7254 1298.2637 1322.6639 1328.1202 1351.9297 1357.5423 1379.8962 1388.0320 1398.5454 1423.9612 1455.0285 1463.4709 1464.1813 1465.9805 1469.9966 1471.7944 1475.1512 1475.8460 1481.7681 1488.0757 1492.1782 1515.8279 1593.9221 1631.3629 1642.5645 2927.6231 2947.5718 2953.0527 2953.6149 2962.1715 2970.4209 2972.1517 2980.8985 2988.1866 2995.8943 2997.7627 3017.1237 3030.8622 3036.7440 3062.5260 3068.7544 3071.3063 3120.8320 3129.2453 3142.9958 3164.6778 3576.3817 3717.4687
redmass: 4.3931 4.2307 3.3091 1.6876 2.8037 3.9322 2.2981 2.0325 2.4917 2.2769 4.4001 2.9458 3.7739 1.8238 1.1361 3.3956 1.1711 1.6188 3.5266 1.0852 4.0463 6.0770 3.1301 3.7475 2.7419 3.2182 4.9543 5.9533 4.1140 3.1644 6.3691 2.1932 1.0643 1.0912 6.1286 1.2525 1.3604 2.1139 1.1929 1.8732 1.4035 1.1887 4.4620 7.2937 3.6379 1.1197 4.5130 3.0915 1.5508 3.0016 2.1428 2.3147 1.2628 2.8535 2.2683 1.4291 1.3265 2.0533 1.6147 2.1577 1.2944 1.3494 1.5548 1.2182 1.3227 1.0389 1.0807 1.1228 1.3847 3.1897 1.5320 1.6528 1.8831 1.2185 2.9862 1.5709 2.2500 1.0511 1.0715 1.0717 1.0742 1.0763 1.0766 1.0425 1.0920 1.1031 1.1165 2.7761 7.4451 1.9576 1.9678 1.0546 1.0336 1.0588 1.0586 1.0592 1.0581 1.0372 1.1058 1.0970 1.0593 1.1003 1.1034 1.1033 1.1046 1.1045 1.1008 1.0993 1.0982 1.0887 1.0901 1.0936 1.0447 1.1041
irintensity: 1.2778 0.3841 2.6954 0.9453 5.2010 0.7432 1.8927 0.6246 0.0955 1.2465 0.2645 0.6436 2.2315 0.5691 0.0002 0.3913 221.8952 42.0824 0.6733 51.3113 1.7557 0.0389 7.4930 0.1828 2.2338 0.1383 0.3634 4.1978 4.1388 11.6589 2.6575 2.6651 12.6373 0.4416 37.4833 27.8241 12.3804 59.0498 3.2877 2.6368 0.1223 0.3195 17.5365 53.3058 28.0137 0.4534 18.8372 4.6318 8.9635 11.6626 0.9629 17.3139 0.1765 11.0997 144.2538 0.5875 11.4956 75.7495 0.4449 306.6684 22.7595 0.0002 10.0496 0.3235 4.3365 0.0342 0.8815 0.0348 2.1333 41.0328 0.3801 1.1662 25.4539 11.1449 20.8921 1.7320 33.5267 11.8278 0.2463 0.1012 4.6454 55.2161 1.4942 12.3752 21.5914 11.1807 52.1381 253.6585 52.3575 11.6244 222.4882 45.4070 72.4431 0.7489 6.3423 19.5367 122.3929 33.4940 35.0078 1.6697 37.2806 1.3224 0.1907 54.2420 64.4399 72.0039 115.2302 55.4547 25.1198 22.9676 20.9603 12.7170 62.4202 17.3835
temp: 298.150 k
press: 1.00000 atm
elementType: 8 8 7 6 6 6 6 6 6 6 6 6 6 6 6 6 6 1 1 1 1 1 1 1 1 1 1 1 1 1 1 1 1 1 1 1 1 1 1 1
symmnumber: 1
zpe: 905606.2 jmol-1
zpe.correction: 0.344927 hartree
zpe.thermalcorrener: 0.364902 hartree
zpe.thermalcorrenthalpy: 0.365846 hartree
zpe.thermalcorrgfe: 0.294969 hartree
zpe.sumelectzpe: -751.122470 hartree
zpe.sumelectthermal: -751.102495 hartree
zpe.sumelectthermalent: -751.101551 hartree
zpe.sumelectthermalfe: -751.172428 hartree
dipole: 2.2241 -0.9588 0.0094
dipole: 2.4220
quadrupole: -72.5767 -94.4905 -108.4639
quadrupole: 1.1725 0.0362 0.0065
quadrupole: 19.2670 -2.6468 -16.6202 1.1725 0.0362 0.0065
hfenergy: -751.4673971 hartree
pointgroup: C01 [X(C14H23N1O2)]
dipole: -0.8708272 -0.3868116 -0.0017305 debye
polarizability: 241.2308891|8.9061998|177.2122417|-0.1304709|-0.1927475|104.9501883 unknown
InChI: InChI=1S/C14H23NO2/c1-3-4-5-6-7-10-17-13-9-8-12(15)11-14(13)16-2/h8-9,11H,3-7,10,15H2,1-2H3
charge 0 multiplicity 1
40 atoms
O  -0.54297 0.414966 0.001198
O  -2.623664 2.070861 -0.002648
N  -5.803865 -1.701737 0.008411
C  4.442604 0.444323 -0.008324
C  3.171375 -0.434542 -0.006425
C  5.752206 -0.375734 -0.008574
C  1.868965 0.397575 -0.005426
C  7.023421 0.503972 -0.009565
C  0.617828 -0.484387 -0.000204
C  8.328134 -0.321817 -0.008746
C  -1.816267 -0.186783 0.002936
C  -2.936611 0.70341 0.001041
C  -2.062139 -1.575007 0.006696
C  -4.251313 0.192944 0.002932
C  -4.48929 -1.212717 0.006662
C  -3.378505 -2.090896 0.008507
C  -3.739694 3.01345 -0.005208
H  4.427237 1.111085 0.878883
H  4.425699 1.109552 -0.896607
H  3.187994 -1.10052 -0.894757
H  3.190043 -1.09969 0.88253
H  5.769035 -1.042646 -0.896103
H  5.769749 -1.04141 0.879929
H  1.841212 1.059095 0.881509
H  1.836941 1.054574 -0.895557
H  7.004856 1.17041 0.876942
H  7.004883 1.168679 -0.897353
H  0.59584 -1.133857 0.902377
H  0.590517 -1.13753 -0.899943
H  8.385045 -0.972758 -0.901708
H  9.221364 0.329706 -0.007623
H  8.383343 -0.973323 0.883928
H  -1.223762 -2.277614 0.008285
H  -5.105448 0.87821 0.001506
H  -3.536525 -3.175502 0.01134
H  -6.59749 -1.069617 0.006504
H  -5.982742 -2.700601 0.010485
H  -3.272153 4.009036 -0.008529
H  -4.370817 2.894937 -0.908964
H  -4.370137 2.900705 0.899762
