program: Gaussian 09
title: 000296010
version: EM64L-G09RevD.01
frameworkgroup: C1[X(C9H9NO4)]
method: RPBEPBE
basis: SDD
operation: Freq
keyword: #pfreq=noraman
keyword: PBEPBE/SDD
title: #p freq=noraman PBEPBE/SDD
converged: YES YES NO NO
title: Mulliken charges:
elementType: O O O O N C C C C C C C C C H H H H H H H H H
charge: -0.442039 -0.441977 -0.240744 -0.240768 -0.056407 0.151887 0.151885 0.055988 0.056041 -0.287987 -0.741612 -0.741603 0.093772 0.093785 0.330290 0.247438 0.246714 0.246877 0.247045 0.247437 0.246555 0.388713 0.388711
chargesum: 0.00000
title: Mulliken charges with hydrogens summed into heavy atoms:
elementType: O O O O N C C C C C C C C C
charge: -0.053326 -0.053266 -0.240744 -0.240768 -0.056407 0.151887 0.151885 0.055988 0.056041 0.042303 -0.000584 -0.000566 0.093772 0.093785
polarizability: 1.78263015e+02 -1.23323114e-03 1.34683728e+02 1.09655521e-02 3.01080304e-02 5.63777095e+01
1716.lowfreq: -10.8507 -5.8190 -0.0014 -0.0012 -0.0012 4.7025 38.2219 43.4098 54.3676
frequency: 38.2114 43.3708 54.3090 124.6547 146.2447 148.5695 150.0999 235.4390 239.3362 295.2592 308.2757 325.6907 346.4525 379.8493 433.5964 435.6391 547.2317 549.7510 573.6879 587.9720 609.8769 611.4533 667.2592 693.0333 710.0220 762.3846 769.3631 778.4292 958.7981 962.7927 987.8537 1000.6498 1034.4911 1040.1916 1049.4309 1086.0422 1150.9937 1218.8171 1256.0609 1297.1158 1306.0200 1307.6001 1363.3652 1397.4139 1398.9635 1435.6071 1442.8949 1451.6705 1452.2897 1452.8771 1520.0886 1584.0400 1636.3016 1647.2758 2999.9679 3000.2141 3076.6699 3076.8099 3130.6050 3130.9244 3201.5537 3528.5955 3528.7766
redmass: 9.9251 10.5730 3.5949 4.1108 5.1048 1.0991 1.1044 3.7322 5.2170 5.1893 2.8251 6.1998 8.6005 4.7753 3.3432 7.0531 3.7470 2.0645 5.2787 1.2478 4.5697 1.5105 5.1627 5.7770 5.8044 8.6253 3.2435 4.4595 4.6706 2.0059 1.4856 3.2449 1.6299 1.9685 1.6464 1.9823 2.0481 1.7383 4.5104 1.9746 5.6436 3.6617 4.3840 1.2256 1.2414 2.6808 1.3884 1.0508 1.2163 1.0478 8.6096 6.4380 8.5876 8.6049 1.0375 1.0375 1.0949 1.0947 1.1012 1.1013 1.0926 1.0642 1.0643
irintensity: 0.0006 1.4908 0.0004 1.3354 0.3100 1.8946 0.0232 4.2371 1.6175 0.0016 5.9078 0.5971 2.4701 1.0683 15.7717 19.4613 2.7187 0.0026 31.2983 248.4772 39.3840 0.0935 27.7383 77.9411 0.2105 0.0001 9.9611 0.9322 28.6330 85.6295 9.6735 382.3000 16.5661 1.3624 0.0397 83.4524 173.0926 1.3790 0.2531 90.5542 21.3561 60.9505 100.2419 58.3651 3.0069 26.6627 2.5633 0.6473 29.2471 31.1835 114.2924 42.9035 667.2956 54.3374 1.7745 1.5901 0.6302 12.4531 0.5898 28.9622 5.8147 32.9516 66.1207
temp: 298.150 k
press: 1.00000 atm
elementType: 8 8 8 8 7 6 6 6 6 6 6 6 6 6 1 1 1 1 1 1 1 1 1
symmnumber: 1
zpe: 440699.6 jmol-1
zpe.correction: 0.167854 hartree
zpe.thermalcorrener: 0.181407 hartree
zpe.thermalcorrenthalpy: 0.182351 hartree
zpe.thermalcorrgfe: 0.126717 hartree
zpe.sumelectzpe: -703.012239 hartree
zpe.sumelectthermal: -702.998685 hartree
zpe.sumelectthermalent: -702.997741 hartree
zpe.sumelectthermalfe: -703.053375 hartree
dipole: 0.0000 -2.1634 -0.0073
dipole: 2.1634
quadrupole: -85.9276 -73.2080 -80.2508
quadrupole: 0.0017 0.0290 -0.0070
quadrupole: -6.1322 6.5875 -0.4553 0.0017 0.0290 -0.0070
hfenergy: -703.1800924 hartree
pointgroup: C01 [X(C9H9N1O4)]
dipole: 0.0320938 -0.8476578 0.0698736 debye
dipolederiv: -0.2993373 0.0166166 -0.0012695 -0.1849553 -1.3447083 0.0729782 0.0147667 0.0719279 -0.4289976 -0.317909 0.061069 -0.0055457 0.2626526 -1.3254093 0.0751931 -0.0227175 0.0770564 -0.429719 -1.146142 0.0833534 -0.0052334 -0.0597773 -0.6223775 0.0250071 0.0045949 0.02453 -0.3062664 -1.1412856 -0.1217803 0.0148802 0.0209607 -0.6266975 0.0274187 0.0006329 0.0282709 -0.3067586 -1.0526218 -0.0287954 0.0066815 -0.0285523 -0.2786193 0.0021658 0.0091161 0.0020743 -0.2529887 -0.7900977 -0.1809346 0.0168254 0.0441272 -0.5611765 0.044457 -0.0001763 0.0433883 0.0023122 -0.7991722 0.1636984 -0.0101725 -0.0613081 -0.5516912 0.0446107 0.0089546 0.0460445 0.0020304 0.7719696 -0.2680546 0.0166663 -0.0924839 0.5439528 -0.0364583 0.002896 -0.0361947 0.0802706 0.7436563 0.2822439 -0.0262144 0.1067133 0.5717338 -0.0393778 -0.0117828 -0.0404533 0.0806534 0.5784457 0.0218539 -0.0030025 0.0216719 -0.0049074 -0.0035044 -0.0045455 -0.0032145 -0.0465626 -0.3808759 0.278341 -0.0200729 0.1040236 0.0153654 -0.0003906 -0.0120899 0.004857 -0.0002356 -0.3499642 -0.3055627 0.0259138 -0.1318704 -0.0162499 0.0010424 0.00816 -0.0033194 0.0004445 1.6375417 0.1980237 -0.017247 0.4441503 1.6694514 -0.1144739 -0.0359538 -0.1145288 0.2308907 1.6860371 -0.1981349 0.0091571 -0.4440324 1.6201742 -0.117205 0.031198 -0.1173737 0.2317121 0.1737816 0.0034877 -0.0001492 0.0034907 0.0817617 0.0051854 -0.0008435 0.005087 0.1481411 0.1063996 -0.0982736 0.0062032 0.0125541 -0.0953514 0.0128268 0.0004881 0.0122288 0.1144084 0.0661937 -0.0029859 -0.0678527 0.005478 0.0615306 -0.0634042 -0.0807347 -0.0378325 -0.0023386 0.0666101 0.0049636 0.0677742 0.0154699 0.0737059 0.0547382 0.0812263 0.0266502 -0.012216 0.0677814 0.0056257 0.0719423 -0.0029412 0.0598486 -0.0603322 0.0844222 -0.0316308 0.0009412 0.0988228 0.1127297 -0.010183 0.0022653 -0.0867821 0.0184623 0.0005744 0.0187793 0.1134273 0.0668301 -0.0076676 -0.0718514 -0.0179017 0.0731699 0.0465961 -0.0816332 0.0197751 -0.0150157 0.1060183 -0.0449411 0.0036449 0.0418154 0.3722657 0.001858 -0.0031927 0.0020253 0.3979473 0.1073179 0.025124 -0.0008949 -0.0615501 0.3710104 0.0026062 0.0066398 0.0018525 0.3979197 unknown
polarizability: 178.1999226|1.6111666|134.2524668|-0.476967|-6.1984573|56.8720629 unknown
InChI: InChI=1S/C9H9NO4/c1-4-6(8(11)12)3-7(9(13)14)5(2)10-4/h3,11,13H,1-2H3
charge 0 multiplicity 1
23 atoms
O  -2.184229 -2.384774 0.302225
O  2.418918 -2.211574 0.288303
O  -3.62067 -0.572686 0.161157
O  3.714098 -0.298162 0.120604
N  -0.042805 1.935928 -0.041416
C  -1.190308 -0.209224 0.13135
C  1.263222 -0.117773 0.116149
C  -1.210173 1.221823 0.021139
C  1.175148 1.310372 0.001285
C  0.062807 -0.860842 0.178896
C  -2.473632 2.045394 -0.03355
C  2.37289 2.224939 -0.079587
C  -2.442865 -1.00569 0.19521
C  2.57245 -0.818008 0.168537
H  0.103544 -1.947907 0.264629
H  -2.197439 3.107959 -0.099767
H  -3.09984 1.763085 -0.89873
H  -3.10705 1.870361 0.853821
H  3.020587 1.965375 -0.935493
H  2.017359 3.261566 -0.172993
H  3.015801 2.124426 0.813036
H  -3.053467 -2.866975 0.339967
H  3.322056 -2.627315 0.32013
