program: Gaussian 09
title: 000027359
version: EM64L-G09RevD.01
frameworkgroup: C1[X(C21H29NO2)]
method: RPBEPBE
basis: SDD
operation: Freq
keyword: #p
keyword: freq=noraman
keyword: PBEPBE/SDD
title: #p freq=noraman PBEPBE/SDD
converged: YES YES NO NO
title: Mulliken charges:
elementType: O O N C C C C C C C C C C C C C C C C C C C C C H H H H H H H H H H H H H H H H H H H H H H H H H H H H H
charge: -0.271494 -0.268049 -0.095373 -0.234704 -0.233970 0.562450 0.561767 -0.753610 -0.754442 -0.425903 -0.416370 -0.414355 -0.422268 -0.380082 -0.373995 0.341923 -0.375735 -0.354040 0.314496 -0.282740 -0.381497 -0.614375 -0.613847 -0.538072 0.209731 0.210393 0.208915 0.230949 0.224561 0.224887 0.208126 0.231136 0.226577 0.221744 0.221354 0.228014 0.244247 0.244474 0.234466 0.245319 0.221314 0.203381 0.224587 0.201602 0.189875 0.229550 0.221343 0.225544 0.220501 0.191910 0.243031 0.218787 0.217967
chargesum: 0.00000
title: Mulliken charges with hydrogens summed into heavy atoms:
elementType: O O N C C C C C C C C C C C C C C C C C C C C C
charge: -0.271494 -0.268049 -0.095373 -0.024973 -0.023578 0.562450 0.561767 -0.089185 -0.090293 -0.199326 -0.194626 -0.193001 -0.194254 -0.135835 -0.129520 0.341923 -0.141269 -0.108721 0.314496 0.141956 0.044692 0.026393 0.024108 0.141713
polarizability: 2.82579619e+02 -1.34561132e+01 2.58060045e+02 2.37884034e+01 1.53343007e+01 1.89119789e+02
1716.lowfreq: -16.5738 0.0005 0.0009 0.0011 4.8267 5.4994 9.4400 13.9457 26.3768
frequency: -14.7832 13.6100 26.2515 29.8188 39.4024 51.1612 61.5030 72.0668 98.8565 112.8713 127.9375 149.4966 154.5930 173.0757 193.8986 207.8748 210.4760 214.9915 221.7646 234.0030 252.3366 256.4259 265.9041 272.9562 312.9421 347.5483 353.3725 387.9402 397.2980 413.0967 415.0239 429.4108 440.2743 451.2493 482.3641 506.3699 532.7544 539.4845 557.3140 573.8942 630.4411 635.3154 707.6229 726.1092 739.3231 740.1540 790.6185 796.3957 807.5070 811.4823 827.5049 832.8353 836.4341 841.8543 858.9521 932.1705 937.2712 955.5762 961.1875 962.3976 980.4550 989.8718 997.1101 1001.8810 1009.8539 1032.1450 1034.0569 1044.3123 1063.1783 1065.9657 1074.7106 1089.1568 1095.2076 1111.9052 1113.2953 1116.7139 1135.8821 1138.9731 1156.2654 1165.5934 1178.1834 1181.5518 1203.6774 1208.2688 1224.0976 1227.5806 1247.1469 1256.2889 1265.6463 1282.9462 1291.5477 1296.1573 1310.2618 1320.6792 1326.8158 1330.9773 1379.6662 1381.1092 1386.0309 1391.1773 1394.4155 1417.4436 1418.9210 1420.5321 1436.0151 1442.5806 1460.0453 1465.0460 1467.4975 1469.9209 1471.0125 1472.1831 1473.5971 1475.8867 1479.1510 1484.7884 1485.7251 1488.8734 1501.2608 1502.0875 1584.6510 1585.3399 1622.4239 1622.7054 2852.5985 2862.5227 2892.3230 2954.1949 2960.0493 2963.1698 2975.0867 2977.4208 2979.4965 3021.3072 3025.5375 3028.5452 3039.3180 3055.6629 3068.6754 3069.8528 3077.4710 3080.4125 3085.3513 3085.7889 3116.4276 3118.7269 3120.9751 3123.0424 3125.6903 3155.8932 3159.1726 3162.9338 3164.3706
redmass: 2.7198 4.8528 3.9601 3.7968 3.3223 3.8839 3.9650 3.1211 3.4288 3.7567 2.1632 3.7631 3.4562 3.0372 3.6732 1.1679 1.1353 1.4088 1.3789 1.4935 1.9110 2.3925 3.4954 2.9819 2.0151 2.6929 3.0260 3.9760 3.1433 2.9246 2.9388 2.5842 4.1395 3.1196 3.4976 3.8011 4.1139 2.4636 2.3658 4.6600 6.8947 6.8036 3.2882 3.2251 3.5389 3.8134 3.5349 4.2027 1.3510 1.3688 1.4249 1.6767 1.6039 2.6792 2.0962 1.3951 1.3783 1.2937 1.3659 1.3711 7.2031 6.9176 2.7046 2.8362 2.0635 2.2367 1.5430 1.4996 1.6127 2.0630 3.1591 1.4104 2.2215 1.2606 1.4233 1.5730 1.8744 1.4475 1.3476 1.4146 1.2734 1.2579 1.5426 2.0672 3.3020 3.4360 1.8051 1.7648 2.4976 1.5780 1.2136 1.4428 1.2948 1.5408 1.3843 1.3504 1.8374 1.4993 3.7707 1.2146 1.8056 2.9737 3.0598 1.1472 1.1736 1.1643 1.0469 1.0505 1.0623 1.0529 1.0673 1.0859 1.0757 1.0608 1.0604 1.1083 1.0841 1.0628 2.3147 2.1952 7.0973 6.9468 6.4295 6.4184 1.0568 1.0578 1.0690 1.0332 1.0815 1.0566 1.0425 1.0378 1.0774 1.0731 1.0949 1.0777 1.1036 1.0959 1.0986 1.0982 1.1005 1.1007 1.1005 1.0989 1.0886 1.0895 1.0973 1.0891 1.0891 1.0937 1.0933 1.0950 1.0953
irintensity: 0.1431 0.2426 0.7290 0.5312 0.3662 0.4640 1.3459 0.3707 0.9188 3.5839 3.1377 0.8536 1.6103 1.3226 0.0620 0.9722 0.2675 0.9665 0.0827 0.2560 1.3349 2.2797 0.6357 2.7285 0.1171 13.1111 0.5148 1.1961 0.0877 0.0542 0.0383 0.0369 0.2479 0.9993 0.7812 6.2523 15.3756 14.2667 38.6068 7.1885 0.1210 1.3215 9.9176 10.1826 4.1348 5.2351 14.8355 11.9878 11.2703 23.3359 2.5077 14.9989 77.4674 14.6454 2.2889 0.2845 0.2556 4.5293 0.2207 0.8017 101.2350 48.5836 6.0012 16.1167 0.2206 67.0189 17.4960 21.2892 4.2994 1.7168 2.9981 13.9468 7.8148 0.2286 14.5367 5.6631 6.8898 2.5639 0.3165 11.1620 76.7541 51.4954 26.1670 3.4129 238.8862 171.4683 5.8392 15.6664 17.2457 3.4437 3.1707 3.3603 0.6173 5.2915 1.5999 4.1676 14.8357 3.9742 8.3242 15.9212 3.6452 0.7119 0.7610 3.6951 8.4811 4.6432 10.9825 12.0414 4.2916 19.8948 1.2813 45.3989 52.9107 5.2937 2.8333 53.2321 14.7246 0.6034 108.8856 125.9649 10.2810 3.1775 54.4241 44.3825 68.6116 176.7464 105.6951 73.0732 0.0434 37.8633 6.3679 53.1122 44.1338 35.3641 34.5001 36.5885 51.9658 35.8991 10.5904 59.9368 62.1506 33.1248 57.8421 30.0422 19.6784 31.8438 11.9556 19.5402 18.7058 17.1844 18.0368 4.3866 5.1664
temp: 298.150 k
press: 1.00000 atm
elementType: 8 8 7 6 6 6 6 6 6 6 6 6 6 6 6 6 6 6 6 6 6 6 6 6 1 1 1 1 1 1 1 1 1 1 1 1 1 1 1 1 1 1 1 1 1 1 1 1 1 1 1 1 1
symmnumber: 1
zpe: 1184083.1 jmol-1
zpe.correction: 0.450993 hartree
zpe.thermalcorrener: 0.475823 hartree
zpe.thermalcorrenthalpy: 0.476767 hartree
zpe.thermalcorrgfe: 0.394387 hartree
zpe.sumelectzpe: -1020.966709 hartree
zpe.sumelectthermal: -1020.941879 hartree
zpe.sumelectthermalent: -1020.940935 hartree
zpe.sumelectthermalfe: -1021.023315 hartree
dipole: -0.3505 -0.3158 0.7829
dipole: 0.9140
quadrupole: -119.4098 -138.7767 -143.6136
quadrupole: 1.7183 11.7172 8.1226
quadrupole: 14.5236 -4.8433 -9.6803 1.7183 11.7172 8.1226
hfenergy: -1021.417702 hartree
pointgroup: C01 [X(C21H29N1O2)]
dipole: 0.1443135 0.1738338 0.2797711 debye
polarizability: 281.7320673|-16.9579165|250.8281046|-24.3098188|-24.9437931|197.1992818 unknown
InChI: InChI=1S/C21H29NO2/c1-16(18-6-10-20(23-5)11-7-18)17(2)19-8-12-21(13-9-19)24-15-14-22(3)4/h6-13,16-17H,14-15H2,1-5H3
charge 0 multiplicity 1
53 atoms
O  3.137906 -0.086379 0.776926
O  -3.614202 -3.950825 0.422814
N  6.476699 -0.776585 -0.745758
C  -2.05419 2.390554 0.119818
C  -2.922956 1.631331 -0.954215
C  -0.671408 1.747781 0.263402
C  -3.126717 0.164581 -0.56237
C  -1.93429 3.908051 -0.17947
C  -4.280527 2.332578 -1.222491
C  -0.304038 1.060917 1.449916
C  0.284953 1.812575 -0.779356
C  -3.934074 -0.200153 0.542265
C  -2.50649 -0.880431 -1.296389
C  0.962109 0.46263 1.594457
C  1.562114 1.220091 -0.657184
C  1.902068 0.540086 0.538694
C  -4.127632 -1.551296 0.910528
C  -2.68471 -2.232812 -0.949596
C  -3.498297 -2.573491 0.158076
C  4.148843 -0.034914 -0.291848
C  5.361379 -0.818448 0.229297
C  7.356343 -1.96043 -0.666441
C  7.247983 0.482791 -0.689656
C  -4.434466 -4.348307 1.566988
H  -2.578278 2.281375 1.092215
H  -2.347011 1.647691 -1.902938
H  -1.526771 4.090298 -1.192198
H  -1.252436 4.387981 0.545306
H  -2.913124 4.414569 -0.112895
H  -4.139514 3.329504 -1.675398
H  -4.861755 2.464066 -0.289995
H  -4.893248 1.727704 -1.914753
H  -1.027594 0.985458 2.270831
H  0.04061 2.338196 -1.71098
H  -4.433015 0.578455 1.132582
H  -1.864608 -0.628167 -2.149103
H  1.241521 -0.070008 2.508815
H  2.271705 1.292808 -1.486957
H  -4.761524 -1.790229 1.770131
H  -2.203208 -3.036808 -1.514718
H  3.763413 -0.505796 -1.217289
H  4.408095 1.021278 -0.510422
H  5.053608 -1.869244 0.375553
H  5.649893 -0.420137 1.232637
H  7.907216 -2.044199 0.304773
H  6.760385 -2.87969 -0.803643
H  8.106165 -1.917259 -1.477122
H  7.987572 0.500904 -1.510008
H  6.580183 1.351413 -0.821906
H  7.797301 0.615511 0.277311
H  -4.38005 -5.446779 1.593081
H  -4.036332 -3.93316 2.513916
H  -5.488497 -4.031033 1.439864
