program: Gaussian 09
title: 000295970
version: EM64L-G09RevD.01
frameworkgroup: C1[X(C6H13NO)]
method: RPBEPBE
basis: SDD
operation: Freq
keyword: #p
keyword: freq=noraman
keyword: PBEPBE/SDD
title: #p freq=noraman PBEPBE/SDD
converged: YES YES NO NO
title: Mulliken charges:
elementType: O N C C C C C C H H H H H H H H H H H H H
charge: -0.452641 -0.038394 -0.042393 -0.484689 -0.479893 -0.427491 -0.395265 -0.629949 0.240240 0.233193 0.226193 0.235166 0.203512 0.223363 0.215796 0.198694 0.189925 0.227042 0.188376 0.228915 0.340297
chargesum: 0.00000
title: Mulliken charges with hydrogens summed into heavy atoms:
elementType: O N C C C C C C
charge: -0.112344 -0.038394 0.197847 -0.025302 -0.041215 0.011668 -0.006645 0.014385
polarizability: 8.14025105e+01 9.40793834e-01 7.15864321e+01 -2.96807518e-01 1.23139338e-01 6.57906176e+01
1716.lowfreq: -20.2106 -14.8615 -8.3011 0.0005 0.0009 0.0010 63.3568 111.6928 172.1253
frequency: 57.8605 111.5509 172.1166 196.4545 223.1089 269.3906 359.8879 371.5766 397.3864 432.1063 592.9737 663.4183 782.9490 796.1614 864.0408 894.1936 928.0984 969.4107 975.4842 987.8436 1022.9339 1042.1002 1076.5570 1101.4209 1124.7854 1151.3674 1172.4327 1209.5761 1220.3098 1246.9233 1262.7280 1280.3737 1295.4523 1310.2072 1316.8984 1349.3707 1401.6519 1429.4600 1464.7151 1465.6627 1470.6457 1474.0700 1478.7647 1484.8793 2869.9035 2918.1995 2969.5126 2982.7109 2989.2495 3011.4846 3019.8799 3024.1255 3051.8187 3068.5154 3080.2227 3087.3791 3558.8217
redmass: 2.8507 3.3314 2.2588 1.3698 1.7793 1.0905 2.3015 2.4570 2.0977 2.3649 2.4544 4.5412 2.0918 3.4874 2.1675 1.9436 2.5167 1.4733 3.3171 2.8657 2.5257 1.9529 1.5970 1.7203 1.4099 1.3036 1.4426 1.2384 1.4834 1.3599 1.3021 1.5007 1.2238 1.3780 1.3751 1.4105 1.4526 1.1477 1.0827 1.0805 1.0638 1.0879 1.0590 1.0726 1.0545 1.0550 1.1041 1.0649 1.0634 1.0644 1.0849 1.0755 1.1042 1.0989 1.1006 1.1026 1.0664
irintensity: 0.1880 7.8667 2.5818 3.1666 7.1019 151.8135 4.4511 3.8865 0.2682 8.6904 1.8184 41.6902 0.8286 3.8043 5.0197 1.3772 28.4970 7.3244 1.0284 64.8471 21.0267 31.4971 17.3439 0.5331 10.8065 6.7446 3.1005 18.0174 6.8158 2.8148 14.4490 4.7498 1.4167 3.3853 0.8906 1.2511 4.3192 4.4185 10.1986 6.3273 7.4782 7.1854 8.4945 11.3574 103.6906 68.1160 53.8421 63.0701 37.4492 17.0541 70.4011 46.1589 32.1944 17.0549 46.0002 55.5074 1.3889
temp: 298.150 k
press: 1.00000 atm
elementType: 8 7 6 6 6 6 6 6 1 1 1 1 1 1 1 1 1 1 1 1 1
symmnumber: 1
zpe: 487664.4 jmol-1
zpe.correction: 0.185742 hartree
zpe.thermalcorrener: 0.194622 hartree
zpe.thermalcorrenthalpy: 0.195566 hartree
zpe.thermalcorrgfe: 0.152183 hartree
zpe.sumelectzpe: -365.703529 hartree
zpe.sumelectthermal: -365.694648 hartree
zpe.sumelectthermalent: -365.693704 hartree
zpe.sumelectthermalfe: -365.737087 hartree
dipole: -0.9296 -1.6277 -0.9036
dipole: 2.0809
quadrupole: -52.8244 -47.9514 -49.0192
quadrupole: 5.8794 -1.1175 1.3483
quadrupole: -2.8927 1.9802 0.9125 5.8794 -1.1175 1.3483
hfenergy: -365.8892702 hartree
pointgroup: C01 [X(C6H13N1O1)]
dipole: 0.27098 0.5381194 -0.5542786 debye
dipolederiv: -0.8517983 0.1399289 0.0138483 0.2312506 -0.3335819 -0.2361604 -0.0107023 -0.212922 -0.4193688 -0.7156022 0.0822245 -0.0729625 0.0768145 -0.409116 0.0342763 0.1125948 -0.0100347 -0.4561346 -0.1330536 -0.0106569 0.0586491 0.0281611 -0.0016973 -0.0369419 0.1740576 -0.0459715 0.0381758 -0.1025762 0.0074901 0.0569497 -0.0729239 -0.0411768 -0.0271327 0.0335438 -0.016235 0.0821207 0.4110842 0.039792 0.0336536 0.0511195 0.1802832 0.0934587 0.0039512 0.1037972 0.2945674 0.3217751 -0.0535039 -0.0253384 -0.0814384 0.3484953 -0.0681064 -0.1061395 -0.0735501 0.2329356 0.7687326 -0.1004613 -0.0560014 -0.1098669 0.3216243 0.1085831 -0.0977523 0.109539 0.3489735 0.3093153 -0.065347 0.0305738 -0.0829823 0.1061758 -0.0683658 0.0045794 -0.075015 0.4151392 -0.0274356 -0.006629 -0.0914628 0.0004206 0.043021 0.0396969 -0.1082828 0.0145317 -0.1027209 -0.002415 0.1232196 -0.0366369 0.093195 -0.0819374 0.0455358 -0.0407505 0.0767758 0.0591755 0.0613108 -0.0151274 0.0085118 -0.0167332 0.0652225 0.0243207 0.0344533 -0.0269389 -0.1587052 -0.0160913 -0.0074767 -0.0111462 0.0000559 0.0667057 -0.0102937 -0.0017283 -0.0763378 -0.2050985 0.0578706 -0.0075693 -0.0100069 -0.0027887 -0.1581357 0.0416306 -0.0058646 0.1112929 0.0472625 -0.0464838 -0.1072706 -0.0570747 -0.076695 -0.0270316 -0.0553816 -0.0970749 -0.1161125 0.0136173 0.0260878 0.0374726 0.0020173 0.0239769 -0.000531 0.0739919 0.0457248 0.1376537 -0.1669513 -0.0617691 -0.052366 0.0016334 -0.0268971 -0.2171871 -0.0845384 -0.0009356 -0.1065757 0.0223496 -0.1018855 0.0686986 -0.1036619 0.0621972 0.0222111 -0.0068824 -0.117019 0.0526405 -0.1449967 -0.0784854 -0.0943118 -0.0764531 -0.1524843 0.0254558 -0.0739083 -0.066762 -0.0192677 0.0371944 -0.0943004 0.0047025 0.2060802 0.0386758 0.0595602 0.0035608 0.0718309 0.0407234 -0.2145069 0.0768738 0.0597852 0.004049 0.1233203 -0.1508244 0.0424152 -0.0009413 -0.0061317 0.0598507 0.1988462 -0.0425941 0.1247788 -0.1063776 0.1824643 0.1602418 0.1732172 0.1381387 0.2171207 unknown
polarizability: 81.062311|1.6817288|71.2665067|-1.2169558|-1.8755311|66.4507424 unknown
InChI: InChI=1S/C6H13NO/c1-7-3-2-6(4-7)5-8/h6,8H,2-5H2,1H3
charge 0 multiplicity 1
21 atoms
O  2.795178 0.045416 -0.707937
N  -1.772656 0.11447 0.319978
C  0.706517 0.111312 0.51269
C  0.204149 -1.263572 -0.027344
C  -0.621035 0.897314 0.860567
C  -1.296514 -1.299407 0.394177
C  1.590202 0.866585 -0.484729
C  -2.185786 0.524799 -1.043882
H  1.303585 -0.03848 1.431724
H  0.784867 -2.109247 0.376263
H  0.300464 -1.295736 -1.128445
H  -0.726625 0.976343 1.95877
H  -0.632576 1.923507 0.448875
H  -1.921809 -1.955051 -0.235877
H  -1.388482 -1.645251 1.442592
H  1.868804 1.861032 -0.071519
H  1.03834 1.023047 -1.439149
H  -3.038277 -0.099839 -1.364856
H  -1.387579 0.442228 -1.822931
H  -2.531274 1.573539 -1.019983
H  3.406008 0.51589 -1.329682
