program: Gaussian 09
title: 000295967
version: EM64L-G09RevD.01
frameworkgroup: C1[X(C9H6Cl2F3NO)]
method: RPBEPBE
basis: SDD
operation: Freq
keyword: #p
keyword: freq=noraman
keyword: PBEPBE/SDD
title: #p freq=noraman PBEPBE/SDD
converged: YES YES NO NO
title: Mulliken charges:
elementType: Cl Cl F F F O N C C C C C C C C C H H H H H H
charge: -0.024241 -0.057290 -0.165522 -0.157583 -0.162550 -0.236646 -0.440949 0.655991 0.335120 -0.449426 -0.403627 -0.361740 -0.196650 0.254522 0.261024 -0.672723 0.341047 0.272966 0.266358 0.336448 0.302715 0.302757
chargesum: 0.00000
title: Mulliken charges with hydrogens summed into heavy atoms:
elementType: Cl Cl F F F O N C C C C C C C C C
charge: -0.024241 -0.057290 -0.165522 -0.157583 -0.162550 -0.236646 -0.104501 0.655991 0.335120 -0.108379 -0.403627 -0.088775 0.069708 0.254522 0.261024 -0.067252
polarizability: 1.82097960e+02 -1.02838505e+00 1.49660962e+02 1.64899984e-01 -4.56905534e-02 5.88896569e+01
1716.lowfreq: -5.3009 -4.5208 -0.0015 0.0010 0.0012 4.8625 12.9447 28.9880 70.9320
frequency: 11.0344 28.9746 70.9302 76.5224 79.6434 88.7780 121.1699 180.3329 184.4548 230.8672 262.6498 280.5612 333.5071 353.0689 375.9287 402.3661 443.4643 471.2450 485.4179 495.2508 530.4508 558.9770 627.5305 642.1500 649.6596 695.6255 731.4050 733.9762 779.8597 820.6004 892.6290 907.2962 946.3663 947.1501 957.5263 989.5525 1016.9114 1029.2673 1058.7134 1152.7129 1155.2184 1202.5841 1243.3397 1258.6477 1266.7909 1308.2140 1382.6575 1417.8202 1430.4283 1457.0572 1533.0384 1594.1098 1607.1608 1615.1468 3070.6627 3151.7394 3168.0748 3183.6436 3186.6731 3410.6240
redmass: 17.0730 11.3854 6.8086 14.0768 3.6426 5.5237 19.7904 9.0099 12.5258 12.0739 17.0044 5.2302 13.0884 8.2366 13.7946 8.0112 4.4640 9.1394 5.5024 7.3974 9.0542 3.3091 10.3260 4.8947 7.7281 6.4404 3.3621 6.3794 1.3000 1.3626 7.2681 1.7391 6.3779 1.4576 1.4062 7.6606 7.1107 5.9775 3.4780 1.4342 1.1121 2.7226 1.9729 1.3567 1.5958 2.3672 8.9056 1.1650 3.9722 2.6453 2.3344 6.2258 5.7580 6.9387 1.0566 1.1090 1.0891 1.0933 1.0979 1.0766
irintensity: 0.0827 0.2300 1.6636 0.3696 15.2492 0.7081 0.3806 1.9373 6.5523 1.6044 1.5815 0.8909 15.2617 2.9945 1.7429 10.6547 6.1216 19.4717 4.7226 27.2940 1.0924 0.2986 3.0443 2.8979 1.3051 86.3509 10.3726 2.1520 47.7233 64.2751 59.8768 14.1079 14.9059 63.1676 33.9912 176.5234 71.6814 120.5153 121.5464 2.2588 0.4484 93.9354 6.7551 96.1811 48.0980 126.4122 59.3342 67.6365 113.3172 43.0002 438.7497 113.7715 169.7679 20.8044 2.3078 0.2682 0.1201 15.1497 3.0374 90.1406
temp: 298.150 k
press: 1.00000 atm
elementType: 17 17 9 9 9 8 7 6 6 6 6 6 6 6 6 6 1 1 1 1 1 1
symmnumber: 1
zpe: 360603.3 jmol-1
zpe.correction: 0.137347 hartree
zpe.thermalcorrener: 0.152541 hartree
zpe.thermalcorrenthalpy: 0.153485 hartree
zpe.thermalcorrgfe: 0.091307 hartree
zpe.sumelectzpe: -1695.040770 hartree
zpe.sumelectthermal: -1695.025576 hartree
zpe.sumelectthermalent: -1695.024632 hartree
zpe.sumelectthermalfe: -1695.086810 hartree
dipole: 2.7223 2.4854 -0.1328
dipole: 3.6886
quadrupole: -113.3006 -103.3054 -106.6155
quadrupole: -13.7534 0.4514 0.0330
quadrupole: -5.5601 4.4351 1.1250 -13.7534 0.4514 0.0330
hfenergy: -1695.1781168 hartree
pointgroup: C01 [X(C9H6Cl2F3N1O1)]
dipole: 0.8407303 1.166109 0.1984575 debye
dipolederiv: -0.3931308 -0.3155246 -0.0650063 -0.2691449 -0.4412573 -0.0937025 -0.052881 -0.0914672 -0.0535938 -0.5235125 -0.0875338 -0.0032349 -0.3072813 -0.3588504 -0.0391836 -0.0596062 -0.0503087 -0.1541201 -0.8552732 0.0372658 -0.2143329 0.0081164 -0.4002528 0.0615909 -0.1768862 0.0726161 -0.3646546 -0.3998964 -0.017043 0.0582823 -0.0691651 -0.6450626 -0.2691366 0.0567723 -0.2170107 -0.4881928 -0.5087003 -0.2220052 0.1057519 -0.2868801 -0.5488795 0.2044833 0.1721355 0.252356 -0.6699737 -0.6681162 -0.2984543 -0.0585761 0.3671613 -0.9538453 -0.1757109 0.109186 -0.1428774 -0.3795497 -1.4293341 0.5494554 0.1991122 0.7270074 -0.8845345 -0.1928264 0.2425351 -0.1850594 -0.332112 1.0534805 -0.5838788 -0.1995795 -0.2626572 -0.1305544 -0.0556438 -0.1076027 -0.0386098 0.1348575 -0.2016624 -0.2191672 -0.0598039 -0.1531152 -0.1585286 -0.0006318 -0.1156803 -0.0565938 -0.1663056 -0.2022047 0.2618756 0.0749216 -0.1598131 -0.0582277 0.0229362 -0.0286724 0.0186991 -0.1027215 0.3806295 0.5539625 0.1237864 0.5673256 0.5924101 0.1550753 0.1249242 0.1549457 -0.0731668 -0.0711405 -0.031601 -0.0095565 0.1206863 -0.0238544 0.0231081 0.0528731 0.0360727 -0.1175432 -0.1731771 -0.0992385 -0.0195571 -0.1731902 -0.0280568 0.0158831 -0.0359728 0.0161249 -0.0613328 1.8671181 0.358703 0.0876185 0.535989 1.6794515 0.0189206 0.0381409 -0.0554388 1.5339793 1.1617994 -0.0237845 -0.0540056 -1.1011686 1.4188786 0.36525 -0.3291048 0.3128418 0.2994401 0.1789538 0.2138694 0.0521698 0.5407009 0.4612287 0.0551411 0.135985 0.0718544 0.1503525 0.2114155 -0.000957 -0.0024325 -0.0232479 0.1168787 -0.0143255 -0.007129 -0.0179525 0.1746783 -0.0018768 0.0187083 0.0131118 0.016974 0.1031361 -0.0175215 0.0067558 -0.0163029 0.1623788 0.0934574 0.0116165 0.0051989 0.0242152 -0.0037064 -0.0446322 0.006937 -0.0445964 0.1525453 0.401874 -0.017033 -0.0110365 -0.0229165 0.2347501 -0.0114835 -0.012316 -0.0121261 0.2820659 0.0432424 -0.0515772 0.0059252 -0.0567265 0.0397278 -0.0525134 0.0454919 -0.0468586 0.0075954 0.0360544 -0.0376584 -0.0287568 -0.0228695 -0.0108509 0.0449227 -0.0658855 0.0396916 0.0653737 unknown
polarizability: 180.8163262|6.9608294|145.2273912|-4.4629924|21.5889568|64.6048621 unknown
InChI: InChI=1S/C9H6Cl2F3NO/c10-4-8(16)15-7-3-5(9(12,13)14)1-2-6(7)11/h1-3,15H,4H2
charge 0 multiplicity 1
22 atoms
Cl 1.405583 3.29686 0.677277
Cl 4.961596 0.862703 -0.137656
F  -4.030151 -0.521551 -0.729306
F  -2.403599 -2.064208 -1.09452
F  -3.152879 -1.678033 1.007905
O  1.980092 -1.853856 -0.687521
N  1.971665 0.431921 -0.101396
C  0.586908 0.688261 0.030759
C  -1.770764 0.033219 -0.03651
C  -0.409136 -0.300989 -0.183335
C  0.156871 1.995465 0.393976
C  -2.179414 1.337225 0.324225
C  -1.198999 2.326754 0.538661
C  -2.812493 -1.036268 -0.218959
C  2.577091 -0.764908 -0.437187
C  4.10622 -0.782165 -0.515052
H  -0.097337 -1.307962 -0.468808
H  -3.240061 1.582004 0.42488
H  -1.483963 3.345121 0.814645
H  2.603658 1.226486 0.073483
H  4.41528 -1.063201 -1.532399
H  4.499433 -1.507284 0.212339
