program: Gaussian 09
title: 000295964
version: EM64L-G09RevD.01
frameworkgroup: C1[X(C12H16ClNO2)]
method: RPBEPBE
basis: SDD
operation: Freq
keyword: #p
keyword: freq=noraman
keyword: PBEPBE/SDD
title: #p freq=noraman PBEPBE/SDD
converged: YES YES NO NO
title: Mulliken charges:
elementType: Cl O O N C C C C C C C C C C C C H H H H H H H H H H H H H H H H
charge: -0.079772 -0.318481 -0.255997 -0.427548 -0.386506 -0.340746 -0.278290 0.215112 0.278317 -0.685660 -0.322955 -0.323274 -0.247806 -0.237835 0.241157 -0.671019 0.212868 0.213004 0.194888 0.194512 0.207988 0.207870 0.213605 0.213592 0.219084 0.248760 0.306082 0.364832 0.226132 0.228809 0.294705 0.294571
chargesum: 0.00000
title: Mulliken charges with hydrogens summed into heavy atoms:
elementType: Cl O O N C C C C C C C C C C C C
charge: -0.079772 -0.318481 -0.255997 -0.062716 0.039366 0.048655 0.137568 0.215112 0.278317 -0.039380 -0.074195 -0.017192 -0.021674 -0.009026 0.241157 -0.081743
polarizability: 1.98069856e+02 -5.84452262e+00 1.95230861e+02 1.27103707e-01 -1.31517998e-01 8.23531277e+01
1716.lowfreq: -5.7004 -4.2152 0.0017 0.0018 0.0019 2.8428 23.8429 40.1678 40.4731
frequency: 23.8253 40.1455 40.4299 45.7510 81.1619 89.7177 99.0184 105.1008 138.6380 167.8313 202.9283 206.4178 229.6181 242.1757 306.3432 324.4145 384.6705 397.0626 456.3680 462.2195 518.6672 539.2137 581.8170 588.7668 649.5791 681.4884 733.8856 742.4992 755.2750 785.7137 806.3750 812.5318 846.7466 857.4315 903.8776 904.0624 938.5771 943.5691 944.4567 974.7907 984.8691 1041.5360 1041.6748 1081.4069 1107.2267 1123.8051 1147.3382 1150.5046 1173.7488 1197.7376 1214.1058 1219.7107 1254.9732 1256.6478 1274.8959 1279.8835 1286.6283 1304.6852 1347.0748 1377.4035 1391.1240 1397.6408 1418.7898 1443.6971 1469.2645 1471.6843 1477.1438 1477.3587 1486.0822 1493.5793 1529.0399 1597.1853 1609.5129 1610.2172 2952.6598 2967.7071 2977.2628 2995.2307 3009.8739 3012.9507 3060.6166 3068.0961 3076.1680 3078.5442 3136.8584 3149.3802 3154.7900 3169.4712 3193.0567 3434.1131
redmass: 6.0891 4.0968 5.0940 1.7484 3.4413 3.7337 6.5405 3.0510 2.0065 6.6101 4.0685 5.1657 1.1177 6.6007 4.3176 5.4732 8.6676 3.6448 3.2417 5.3045 5.3626 3.4659 3.5358 6.6904 5.8803 6.4406 3.4665 1.0865 1.2776 6.3335 1.1752 1.1340 5.7482 1.3858 1.8018 1.7152 1.2109 1.2760 6.4032 7.0696 1.2992 2.1377 3.2288 2.2311 2.0929 2.6102 1.4621 1.1108 1.0604 2.5366 1.3580 3.1876 1.6964 1.2991 1.3152 1.1731 1.0658 1.6910 1.4712 1.5108 1.2515 5.2051 1.1138 2.4669 1.2025 1.1950 1.2769 1.0614 1.2034 1.2134 2.3626 6.1311 5.6807 8.4143 1.0553 1.0591 1.0362 1.0592 1.1029 1.1044 1.1046 1.0564 1.1016 1.0995 1.0858 1.1092 1.0914 1.0976 1.0956 1.0762
irintensity: 0.0082 0.1384 0.1497 0.4521 14.1719 0.3506 0.5721 4.0818 3.0052 4.1535 1.4524 1.0246 0.1165 6.9511 0.8825 0.7633 3.3635 3.3860 7.7819 27.2175 4.2287 0.0814 0.1533 6.1598 4.5820 72.2056 0.0002 20.9200 74.6871 14.7293 82.4973 1.0095 0.8121 1.1309 19.8917 14.3457 5.0513 3.0809 3.5589 65.3064 2.9656 37.5281 10.5451 9.4309 66.8458 7.2169 1.8411 0.4541 2.9597 81.2196 0.0051 4.6442 133.3792 0.4710 12.3604 0.3020 0.1289 17.7245 1.1955 24.2469 11.9258 7.3112 40.5881 95.1562 27.8131 14.8037 45.3684 16.5536 5.3211 17.7389 405.3229 237.6179 34.3113 90.2743 27.5866 38.1934 31.8817 35.3456 26.7128 0.0329 16.6931 6.1895 100.0232 49.6521 1.8775 1.2451 24.9586 16.1130 5.2782 92.4187
temp: 298.150 k
press: 1.00000 atm
elementType: 17 8 8 7 6 6 6 6 6 6 6 6 6 6 6 6 1 1 1 1 1 1 1 1 1 1 1 1 1 1 1 1
symmnumber: 1
zpe: 680245.2 jmol-1
zpe.correction: 0.259092 hartree
zpe.thermalcorrener: 0.276090 hartree
zpe.thermalcorrenthalpy: 0.277035 hartree
zpe.thermalcorrgfe: 0.211434 hartree
zpe.sumelectzpe: -1130.937505 hartree
zpe.sumelectthermal: -1130.920506 hartree
zpe.sumelectthermalent: -1130.919562 hartree
zpe.sumelectthermalfe: -1130.985162 hartree
dipole: 4.0254 1.2325 0.0160
dipole: 4.2099
quadrupole: -103.2473 -95.7084 -104.5872
quadrupole: 4.6154 -0.0275 -0.0729
quadrupole: -2.0663 5.4726 -3.4062 4.6154 -0.0275 -0.0729
hfenergy: -1131.1965964 hartree
pointgroup: C01 [X(C12H16Cl1N1O2)]
dipole: -1.5563528 0.5234374 -0.2171154 debye
polarizability: 197.8432235|7.1070731|191.8618479|8.0576272|-17.694705|85.9487727 unknown
InChI: InChI=1S/C12H16ClNO2/c1-2-3-8-16-11-7-5-4-6-10(11)14-12(15)9-13/h4-7,14H,2-3,8-9H2,1H3
charge 0 multiplicity 1
32 atoms
Cl 0.304928 -3.737237 0.704253
O  -0.977438 0.212181 -0.07421
O  3.650601 -1.404715 0.577373
N  1.358985 -0.91366 0.302601
C  -3.312312 -0.42691 -0.14551
C  -4.780939 0.022048 -0.332026
C  -2.338959 0.746877 -0.267872
C  0.10775 1.104319 -0.132903
C  1.381864 0.488582 0.07279
C  -5.773403 -1.153237 -0.203747
C  0.011211 2.489818 -0.369002
C  2.552692 1.280374 0.038038
C  1.190137 3.27348 -0.401419
C  2.449641 2.671092 -0.199394
C  2.42603 -1.745179 0.531773
C  2.134568 -3.232811 0.755889
H  -3.185984 -0.899493 0.847384
H  -3.053371 -1.192019 -0.902307
H  -4.899078 0.499424 -1.326187
H  -5.02914 0.798348 0.420367
H  -2.405819 1.219961 -1.26948
H  -2.541362 1.517104 0.505037
H  -5.568158 -1.930795 -0.96303
H  -5.697552 -1.628572 0.791927
H  -6.81667 -0.815071 -0.339105
H  -0.962137 2.963015 -0.52686
H  3.519818 0.79987 0.19736
H  0.419742 -1.335083 0.29505
H  1.115223 4.350548 -0.584961
H  3.359909 3.278898 -0.224817
H  2.502369 -3.531579 1.748385
H  2.632656 -3.82528 -0.025594
