program: Gaussian 09
title: 000295963
version: EM64L-G09RevD.01
frameworkgroup: C1[X(C12H14O2)]
method: RPBEPBE
basis: SDD
operation: Freq
keyword: #pfreq=noraman
keyword: PBEPBE/SDD
title: #p freq=noraman PBEPBE/SDD
converged: YES YES NO NO
title: Mulliken charges:
elementType: O O C C C C C C C C C C C C H H H H H H H H H H H H H H
charge: -0.417358 -0.265669 0.319869 -0.482904 0.001917 0.340708 -0.815254 -0.689262 -0.371504 -0.383577 0.073102 -0.223463 -0.227350 -0.243555 0.256113 0.197934 0.231242 0.261166 0.236170 0.220838 0.255919 0.202616 0.234814 0.235954 0.224867 0.225551 0.227635 0.373481
chargesum: 0.00000
title: Mulliken charges with hydrogens summed into heavy atoms:
elementType: O O C C C C C C C C C C C C
charge: -0.043877 -0.265669 0.319869 -0.028857 0.001917 0.340708 -0.086677 -0.009887 -0.136690 -0.147623 0.073102 0.001404 -0.001799 -0.015920
polarizability: 1.80181985e+02 -4.62593992e+00 1.25923609e+02 -9.39691188e-01 1.19187076e+01 1.03357609e+02
1716.lowfreq: -9.2057 -1.9741 -0.0008 -0.0006 -0.0003 1.6976 28.8643 46.8055 64.9469
frequency: 28.4709 46.8019 64.8799 82.2896 111.2080 149.7693 166.7251 204.1625 214.0359 230.2126 277.7178 349.4333 376.8557 382.9155 403.0989 443.6920 466.4986 543.8090 566.6490 611.7688 620.5060 631.2669 678.4194 703.7508 750.9331 771.7732 790.6179 850.6788 853.1138 920.3884 950.2391 972.3126 974.9586 989.5503 993.6292 1004.4053 1007.9336 1029.7856 1056.4410 1072.8953 1078.7506 1127.2805 1171.6058 1188.7606 1217.7464 1235.7688 1292.5649 1303.3041 1306.8862 1321.0302 1371.1705 1378.7259 1390.9423 1430.6416 1451.8378 1462.4659 1466.1249 1473.9732 1481.8795 1487.2632 1584.5233 1597.2752 1612.3999 1626.7976 2969.7527 2984.8919 2988.2785 3040.1796 3070.5980 3087.8698 3104.3935 3112.1232 3120.3505 3125.4914 3137.9256 3147.5150 3163.2229 3513.1842
redmass: 4.1420 7.2367 3.2350 4.1636 3.2078 2.3120 1.3660 1.9581 1.6419 2.5521 3.4731 4.8448 3.5297 4.0256 2.8219 3.9277 3.0988 2.4794 2.8314 3.7308 3.9278 1.9091 4.7154 1.6768 4.6065 2.4731 1.1810 2.4082 1.2951 1.4638 6.2973 2.1480 1.4156 5.1301 1.3717 1.5552 1.8503 2.1025 1.8919 1.8077 1.6112 1.8117 1.0527 1.1158 3.0177 1.6649 1.8211 1.4901 1.6690 1.9474 6.7078 1.2338 1.2024 2.2282 1.0858 1.0828 1.0823 1.0582 2.2463 1.0886 6.0211 6.0363 6.2462 7.4780 1.0402 1.0419 1.0579 1.0946 1.0972 1.0970 1.1011 1.0972 1.0846 1.0875 1.0923 1.0967 1.1017 1.0638
irintensity: 0.5454 0.9706 0.2103 0.6690 0.2115 1.9572 0.3372 0.0595 0.0887 0.4772 0.0326 1.4673 4.9889 5.3314 0.4953 8.7995 2.1364 14.5697 15.4742 18.4163 44.7846 84.1254 16.4255 55.5530 7.4019 30.3860 7.4476 15.4463 0.6199 0.9873 35.5373 52.2318 1.2754 0.9906 0.6518 6.3771 28.7701 18.3839 189.7134 6.7740 9.1417 86.4747 0.0133 0.3355 6.3236 1.2881 21.2637 14.8973 17.9960 29.0288 0.4327 21.2460 21.2056 7.0177 12.1826 10.5620 15.3420 10.7371 16.0289 14.9240 2.0651 164.5605 14.1599 135.6466 13.9203 37.1906 48.6332 15.3253 16.2590 29.1735 24.4642 16.6117 2.6463 0.0019 18.0781 42.0262 22.5336 36.6332
temp: 298.150 k
press: 1.00000 atm
elementType: 8 8 6 6 6 6 6 6 6 6 6 6 6 6 1 1 1 1 1 1 1 1 1 1 1 1 1 1
symmnumber: 1
zpe: 597953.9 jmol-1
zpe.correction: 0.227749 hartree
zpe.thermalcorrener: 0.241846 hartree
zpe.thermalcorrenthalpy: 0.242790 hartree
zpe.thermalcorrgfe: 0.185915 hartree
zpe.sumelectzpe: -615.089685 hartree
zpe.sumelectthermal: -615.075588 hartree
zpe.sumelectthermalent: -615.074644 hartree
zpe.sumelectthermalfe: -615.131519 hartree
dipole: -0.7483 -1.6109 0.0068
dipole: 1.7763
quadrupole: -82.0685 -77.7810 -80.0322
quadrupole: -4.0105 -1.2090 3.0676
quadrupole: -2.1079 2.1796 -0.0717 -4.0105 -1.2090 3.0676
hfenergy: -615.3174339 hartree
pointgroup: C01 [X(C12H14O2)]
dipole: 0.3098118 -0.6030267 0.1695579 debye
polarizability: 179.9269584|5.6478622|118.2114849|-2.0194638|-16.1392906|111.3247592 unknown
InChI: InChI=1S/C12H14O2/c1-3-9(2)11(12(13)14)10-7-5-4-6-8-10/h4-8,13H,3H2,1-2H3
charge 0 multiplicity 1
28 atoms
O  -0.189085 2.510136 -0.188336
O  -2.401917 1.863776 -0.338055
C  -1.481685 -0.883191 0.428631
C  -2.992425 -0.782214 0.585904
C  -0.646582 0.170669 0.098995
C  0.845945 0.008659 0.002609
C  -0.943481 -2.285682 0.638879
C  -3.730092 -1.067671 -0.75381
C  1.514613 0.18267 -1.237303
C  1.616053 -0.321721 1.147645
C  -1.1991 1.52897 -0.157488
C  2.913377 0.018403 -1.332755
C  3.017218 -0.480797 1.056841
C  3.671282 -0.313755 -0.185129
H  -3.294176 0.217823 0.935157
H  -3.312145 -1.530472 1.338088
H  -1.599639 -3.014893 0.125845
H  0.087881 -2.416194 0.278652
H  -0.967037 -2.549652 1.715181
H  -4.822726 -1.08105 -0.5910
H  -3.50092 -0.27497 -1.485005
H  -3.436179 -2.044359 -1.181092
H  0.934494 0.447944 -2.128471
H  1.113465 -0.440564 2.114753
H  3.412357 0.152058 -2.299299
H  3.595901 -0.7296 1.953697
H  4.75786 -0.43609 -0.257942
H  -0.623558 3.38857 -0.36509
