program: Gaussian 09
title: 000295991
version: EM64L-G09RevD.01
frameworkgroup: C1[X(C17H17N3S)]
method: RPBEPBE
basis: SDD
operation: Freq
keyword: #p
keyword: freq=noraman
keyword: PBEPBE/SDD
title: #p freq=noraman PBEPBE/SDD
converged: YES YES NO NO
title: Mulliken charges:
elementType: S N N N C C C C C C C C C C C C C C C C C H H H H H H H H H H H H H H H H H
charge: 0.149127 -0.232209 -0.081938 -0.696158 -0.393479 0.094624 -0.428079 -0.538047 0.387501 0.303123 0.010433 -0.450844 -0.825743 -0.356171 -0.217847 -0.224022 -0.215356 -0.153226 -0.398417 -0.403684 0.506302 0.224481 0.251814 0.214805 0.226709 0.222896 0.229664 0.231344 0.309035 0.260941 0.245922 0.218482 0.245605 0.232343 0.217469 0.219772 0.307011 0.305816
chargesum: 0.00000
title: Mulliken charges with hydrogens summed into heavy atoms:
elementType: S N N N C C C C C C C C C C C C C C C C C
charge: 0.149127 -0.232209 -0.081938 -0.083331 0.082816 0.094624 0.013435 -0.085486 0.387501 0.303123 0.010433 -0.219501 -0.255768 -0.110248 0.000635 -0.224022 0.030249 0.079117 -0.180947 -0.183912 0.506302
polarizability: 2.68074808e+02 -5.60194874e-01 2.45277216e+02 2.52215027e+01 -5.73817967e+00 1.56068601e+02
1716.lowfreq: -8.0204 -6.3735 -0.0017 -0.0011 -0.0009 6.3286 11.5458 21.9199 26.9119
frequency: 11.1625 21.0155 26.8214 68.8580 78.2715 125.0985 137.1193 165.1300 196.7635 232.5573 256.4124 290.6502 294.9000 317.5696 354.5140 366.3855 375.0130 380.3923 382.3026 387.7929 412.4390 450.2122 484.3820 514.2711 524.5784 533.0567 554.8366 582.6326 603.8429 621.8538 632.3196 633.4533 673.5019 712.8659 718.2020 756.9460 773.5085 791.5498 811.1175 815.5276 824.0319 847.0544 865.8148 873.9266 893.3216 900.9937 941.8314 954.8176 961.0274 964.1023 989.7776 1016.4531 1020.9509 1045.3455 1062.0045 1076.0138 1077.1347 1118.1626 1122.3068 1155.4010 1172.5817 1180.2434 1181.9878 1197.8215 1222.4994 1244.1101 1253.8946 1261.6266 1289.7677 1309.8538 1313.7101 1323.9800 1345.8667 1349.0203 1376.0966 1379.2450 1396.2816 1418.7705 1426.9267 1443.1367 1458.2421 1466.3804 1477.0525 1485.4338 1490.2749 1495.0126 1572.2755 1608.2104 1619.3325 1639.8016 1644.1847 2969.3669 2974.6810 3001.9135 3030.2523 3040.8032 3056.4628 3068.8271 3120.5472 3120.8780 3122.8180 3131.6553 3142.2663 3149.4246 3154.9675 3167.3039 3566.8141 3706.9811
redmass: 5.7567 3.6384 4.9516 5.7908 5.4626 4.4532 2.9351 3.6064 5.0643 2.9331 4.6378 4.6305 1.8785 4.3890 6.1509 1.5181 3.6822 2.0668 1.4012 2.8801 2.7378 3.0094 4.9677 2.5699 3.7904 4.9818 4.6811 3.7465 5.4093 6.4847 6.8018 3.0526 5.2545 3.5777 5.4875 1.8256 4.2547 2.4895 1.2660 5.1740 1.8059 2.3447 1.9047 2.0189 2.0199 1.4046 1.3711 1.3802 3.6387 1.3385 3.8868 1.4420 2.4769 2.1403 2.4925 2.5062 2.0771 1.5685 1.2199 1.7041 1.3104 1.4914 1.1039 1.4598 1.2394 1.3532 3.6834 1.4153 1.3316 2.4021 2.7309 1.3445 1.6781 1.6808 4.5805 2.3199 5.7780 1.2227 3.6009 2.3873 1.1528 1.1066 2.8957 1.6215 3.0045 3.5185 7.0279 7.9376 4.3630 8.5166 1.2634 1.0656 1.0652 1.0619 1.0625 1.0946 1.0970 1.1043 1.0884 1.0872 1.0881 1.1022 1.0921 1.0957 1.0967 1.0970 1.0449 1.1040
irintensity: 0.8470 0.1645 2.4835 2.2918 3.6430 2.7698 3.5130 0.5343 2.0158 0.5539 0.7208 4.4960 3.0938 5.0777 3.7299 234.4091 24.9290 8.0594 37.5398 8.0422 0.0622 3.8237 0.6230 18.3869 2.2451 0.3796 6.2448 1.1672 5.9957 3.2625 0.1486 2.2519 1.9169 1.4711 2.5603 44.8236 4.3048 25.2408 0.1772 1.1785 80.0330 7.8563 11.6567 5.2587 3.1166 0.6699 0.1501 0.0799 4.6783 1.3463 1.4165 0.1377 0.1379 8.4703 9.8193 5.9674 2.6528 17.0324 12.9466 23.0621 0.1879 5.4905 30.4574 4.6860 9.1965 7.3379 11.5527 11.7946 1.6028 5.1541 71.2492 9.0939 32.1328 20.4479 5.3274 15.0121 10.9822 12.6643 0.0648 21.4881 12.7424 9.8821 8.8653 14.0856 100.7274 13.3306 4.4918 0.9068 103.4919 12.8077 253.1269 30.9605 53.4214 22.3154 18.6811 31.9539 16.8224 43.4555 7.6106 8.2174 29.0960 1.2305 23.8015 25.2323 1.5298 22.0927 81.4863 20.5438
temp: 298.150 k
press: 1.00000 atm
elementType: 16 7 7 7 6 6 6 6 6 6 6 6 6 6 6 6 6 6 6 6 6 1 1 1 1 1 1 1 1 1 1 1 1 1 1 1 1 1
symmnumber: 1
zpe: 797609.4 jmol-1
zpe.correction: 0.303793 hartree
zpe.thermalcorrener: 0.321916 hartree
zpe.thermalcorrenthalpy: 0.322860 hartree
zpe.thermalcorrgfe: 0.255270 hartree
zpe.sumelectzpe: -1218.860414 hartree
zpe.sumelectthermal: -1218.842291 hartree
zpe.sumelectthermalent: -1218.841347 hartree
zpe.sumelectthermalfe: -1218.908937 hartree
dipole: 0.1179 0.6886 -2.4431
dipole: 2.5411
quadrupole: -105.0003 -117.0333 -132.5588
quadrupole: 19.1333 7.5731 -7.1536
quadrupole: 13.1972 1.1642 -14.3614 19.1333 7.5731 -7.1536
hfenergy: -1219.164207 hartree
pointgroup: C01 [X(C17H17N3S1)]
dipole: -0.0570105 0.2255384 0.9722838 debye
polarizability: 268.252259|1.038846|244.6427199|24.0717469|11.1911534|156.5256463 unknown
InChI: InChI=1S/C17H17N3S/c18-13-6-8-14(9-7-13)21-11-16-19-15-5-1-3-12-4-2-10-20(16)17(12)15/h1,3,5-9H,2,4,10-11,18H2
charge 0 multiplicity 1
38 atoms
S  -1.341551 -2.722095 -0.258173
N  1.675548 -1.011729 -0.423434
N  0.476273 0.341867 -1.834998
N  -4.98265 2.015747 0.887545
C  2.237999 -2.13155 0.356092
C  2.236616 0.260279 -0.331204
C  2.940729 -1.567605 1.624505
C  3.965874 -0.431782 1.319478
C  3.322263 0.655777 0.467793
C  0.615419 -0.914984 -1.345755
C  1.493058 1.101542 -1.208463
C  3.671172 2.018158 0.366219
C  -0.257465 -2.059698 -1.717799
C  1.867191 2.464871 -1.300646
C  2.95408 2.898129 -0.507011
C  -2.423413 -1.272524 0.069783
C  -3.725453 -1.223135 -0.484034
C  -1.987066 -0.214257 0.903171
C  -4.579712 -0.137504 -0.213186
C  -2.830961 0.877676 1.176446
C  -4.142842 0.935114 0.619548
H  2.964778 -2.690248 -0.267476
H  1.421279 -2.81722 0.642294
H  3.44647 -2.404763 2.139723
H  2.163878 -1.177161 2.309112
H  4.839263 -0.86098 0.786041
H  4.350956 -0.015849 2.268947
H  4.502356 2.41549 0.961485
H  -0.93467 -1.750244 -2.525789
H  0.310586 -2.956049 -2.022707
H  1.331336 3.153994 -1.960386
H  3.262065 3.948814 -0.557194
H  -4.068175 -2.040544 -1.127445
H  -0.982312 -0.246706 1.338303
H  -5.586329 -0.114067 -0.648368
H  -2.474806 1.693366 1.817241
H  -4.663726 2.793699 1.457153
H  -5.910057 2.069165 0.477193
