program: Gaussian 09
title: 000295962
version: EM64L-G09RevD.01
frameworkgroup: C1[X(C12H26N2)]
method: RPBEPBE
basis: SDD
operation: Freq
keyword: #pfreq=noraman
keyword: PBEPBE/SDD
title: #p freq=noraman PBEPBE/SDD
converged: YES YES NO NO
title: Mulliken charges:
elementType: N N C C C C C C C C C C C C H H H H H H H H H H H H H H H H H H H H H H H H H H
charge: -0.302717 -0.104537 -0.049547 -0.440110 -0.410632 -0.390769 -0.391305 -0.384791 -0.377488 -0.375935 -0.320563 -0.327000 -0.672942 -0.674883 0.200085 0.175816 0.220760 0.209386 0.175910 0.196331 0.191607 0.189865 0.195781 0.197325 0.186615 0.227154 0.220586 0.180233 0.174607 0.223241 0.201286 0.185146 0.205824 0.184660 0.212627 0.225988 0.203490 0.207495 0.227242 0.204159
chargesum: 0.00000
title: Mulliken charges with hydrogens summed into heavy atoms:
elementType: N N C C C C C C C C C C C C
charge: -0.075563 -0.104537 0.150539 -0.043535 -0.025337 -0.002830 -0.005659 -0.000850 0.023331 0.021913 0.065869 0.063484 -0.030838 -0.035987
polarizability: 1.75020357e+02 -1.09328558e+00 1.38387356e+02 -1.69648086e-01 4.31063157e-01 1.21674756e+02
1716.lowfreq: -15.3406 -11.8431 -0.0007 -0.0006 -0.0004 6.1214 28.8347 33.6649 46.9440
frequency: 24.9171 30.4659 46.8533 72.4365 78.2373 88.1443 117.6749 153.6258 178.7252 184.9777 216.2586 230.6234 255.2339 286.5556 308.0688 321.0277 358.4436 406.4739 428.3677 440.9425 448.1355 484.4770 488.8005 562.1015 642.6145 745.8672 780.0605 787.7127 793.5709 794.5904 804.6710 840.8296 878.0667 891.6289 912.2389 917.8535 958.5439 987.9102 1029.6477 1041.3208 1045.9047 1052.4561 1070.5406 1073.9489 1077.1380 1082.9868 1084.3783 1109.8028 1112.0473 1141.4254 1146.6390 1175.0535 1189.9675 1205.9706 1223.4019 1248.7767 1255.5736 1256.5145 1273.9652 1287.1651 1292.9847 1301.5170 1305.3045 1325.6313 1330.6812 1335.0041 1339.2111 1342.7782 1358.7465 1361.6242 1367.3846 1384.1304 1385.2981 1386.2728 1450.5825 1457.1639 1459.5961 1460.4863 1461.5311 1464.3940 1469.1072 1470.4527 1472.5106 1477.7325 1478.8021 1485.0847 1490.0225 1492.1082 2838.2803 2844.1494 2858.9358 2873.9072 2947.8378 2950.4049 2963.6025 2964.2513 2964.5789 2967.2069 2981.6579 2982.6848 3022.7679 3023.0603 3024.7731 3025.8474 3028.3280 3030.3871 3036.7079 3046.5272 3059.4820 3074.1628 3075.3905 3090.6726 3090.9410 3412.8321
redmass: 3.3244 2.9000 2.8343 2.3400 2.2226 2.6458 2.0922 1.7209 1.9602 1.7688 1.5807 1.7860 2.0252 2.1675 2.4871 1.8352 2.5900 2.9341 2.9901 2.1626 2.3905 2.4051 2.6654 2.1985 1.4419 2.4261 1.6679 1.4855 1.2310 1.2838 1.2454 2.0869 1.7629 1.5070 1.9303 1.8882 2.2910 2.2515 2.0404 1.9015 2.0091 1.3077 1.4643 1.9980 2.0809 2.4077 2.1164 1.9671 2.1972 3.5352 1.7289 1.9088 1.6068 2.2632 1.6132 1.2656 1.2917 1.3886 1.1343 1.2071 1.1952 1.2606 1.3139 1.3788 1.3360 1.4020 1.4605 1.4654 1.4030 1.3390 1.3812 1.3129 1.2506 1.3170 1.2188 1.0610 1.0894 1.0525 1.0902 1.0893 1.0614 1.0811 1.0645 1.0955 1.0595 1.0610 1.0745 1.0843 1.0718 1.0720 1.0712 1.0705 1.0736 1.0648 1.0604 1.0698 1.0670 1.0643 1.0356 1.0357 1.0908 1.0928 1.0965 1.0868 1.0999 1.0872 1.1009 1.0986 1.0899 1.0984 1.0979 1.1003 1.1003 1.0734
irintensity: 0.1316 0.0119 0.0744 0.1905 0.5694 0.1447 2.4060 0.9890 0.5519 0.2664 0.1774 0.1887 0.8165 2.8151 1.6702 2.6787 1.4190 1.6294 1.4788 3.9368 3.4067 6.6035 7.3422 1.8024 92.7859 7.1331 3.1818 2.6788 2.6807 6.9844 2.9763 5.0718 5.4457 15.1533 1.0429 0.8083 5.2306 5.6831 17.5648 0.8189 1.9720 2.0579 7.1006 25.7159 10.8719 42.7742 4.7838 12.4460 4.2906 67.9220 6.3755 3.8503 2.6304 33.3838 13.5589 5.5958 2.4011 7.0811 0.7228 22.1035 15.0219 1.5835 0.7994 7.7462 2.0821 1.1783 0.2496 0.8816 2.0461 4.0536 9.5624 9.9742 20.2226 13.2847 28.8187 1.8994 1.9223 6.1458 6.6387 8.8752 0.6310 22.4888 11.5061 2.9768 11.1612 6.1225 18.9088 2.8056 45.8802 48.3436 238.2977 85.6313 7.2604 18.4678 20.7177 25.9517 49.1507 74.7728 36.4578 30.2096 50.8274 58.9718 76.0987 19.5100 5.9637 21.8851 72.0971 84.2850 35.4271 38.5156 82.8511 30.7322 55.1559 2.2094
temp: 298.150 k
press: 1.00000 atm
elementType: 7 7 6 6 6 6 6 6 6 6 6 6 6 6 1 1 1 1 1 1 1 1 1 1 1 1 1 1 1 1 1 1 1 1 1 1 1 1 1 1
symmnumber: 1
zpe: 961306.3 jmol-1
zpe.correction: 0.366142 hartree
zpe.thermalcorrener: 0.383015 hartree
zpe.thermalcorrenthalpy: 0.383959 hartree
zpe.thermalcorrgfe: 0.320155 hartree
zpe.sumelectzpe: -581.173035 hartree
zpe.sumelectthermal: -581.156162 hartree
zpe.sumelectthermalent: -581.155218 hartree
zpe.sumelectthermalfe: -581.219022 hartree
dipole: 0.0594 0.7819 -0.7801
dipole: 1.1061
quadrupole: -86.2474 -91.4860 -89.2252
quadrupole: 0.9003 1.8350 -1.6943
quadrupole: 2.7388 -2.4998 -0.2390 0.9003 1.8350 -1.6943
hfenergy: -581.5391772 hartree
pointgroup: C01 [X(C12H26N2)]
dipole: -0.047531 0.0839007 -0.4243656 debye
polarizability: 174.5818643|-2.6148062|127.4822678|-3.2045368|8.1272742|133.0183371 unknown
InChI: InChI=1S/C12H26N2/c1-3-14(4-2)11-10-13-12-8-6-5-7-9-12/h12-13H,3-11H2,1-2H3
charge 0 multiplicity 1
40 atoms
N  -0.611504 0.850595 0.192619
N  3.040534 -0.11579 -0.223616
C  -1.933222 0.235341 0.465551
C  -2.947259 1.344448 0.832696
C  -2.495638 -0.643771 -0.691321
C  -4.340557 0.764189 1.174443
C  -3.884228 -1.234413 -0.342727
C  -4.888632 -0.116583 0.026135
C  0.538306 -0.065106 0.032712
C  1.856123 0.738987 0.044125
C  4.262602 0.341745 0.490664
C  3.26534 -0.335178 -1.678294
C  4.236267 0.004934 1.994005
C  4.028161 -1.638909 -1.982752
H  -1.803544 -0.417847 1.35555
H  -3.042261 2.040589 -0.029293
H  -2.543805 1.931198 1.678713
H  -1.782335 -1.456688 -0.929956
H  -2.583623 -0.010245 -1.600679
H  -5.047854 1.586034 1.399585
H  -4.261958 0.15031 2.095887
H  -3.780052 -1.927968 0.517925
H  -4.268197 -1.8350 -1.190454
H  -5.864582 -0.555455 0.311751
H  -5.069829 0.518381 -0.866179
H  -0.669633 1.529453 -0.581219
H  0.547365 -0.767083 0.88741
H  0.496936 -0.692653 -0.891064
H  1.781642 1.581063 -0.692772
H  1.956123 1.20829 1.037856
H  5.131923 -0.166045 0.033981
H  4.430379 1.44069 0.351696
H  2.273777 -0.387715 -2.165535
H  3.799143 0.533435 -2.143984
H  3.388884 0.492539 2.509226
H  4.136438 -1.085332 2.135099
H  5.167959 0.344598 2.484477
H  5.039489 -1.638758 -1.537708
H  3.477707 -2.503561 -1.572892
H  4.143715 -1.774521 -3.074667
