program: Gaussian 09
title: 000295961
version: EM64L-G09RevD.01
frameworkgroup: C1[X(C12H16O2)]
method: RPBEPBE
basis: SDD
operation: Freq
keyword: #pfreq=noraman
keyword: PBEPBE/SDD
title: #p freq=noraman PBEPBE/SDD
converged: YES YES NO NO
title: Mulliken charges:
elementType: O O C C C C C C C C C C C C H H H H H H H H H H H H H H H H
charge: -0.415653 -0.242206 -0.024658 -0.311324 -0.383920 0.449562 -0.740916 0.129497 -0.715554 -0.434466 -0.391847 -0.230161 -0.241733 -0.241558 0.210457 0.249321 0.230691 0.227265 0.221314 0.218214 0.226191 0.216900 0.220109 0.207586 0.230616 0.284010 0.225202 0.226076 0.228508 0.372476
chargesum: 0.00000
title: Mulliken charges with hydrogens summed into heavy atoms:
elementType: O O C C C C C C C C C C C C
charge: -0.043177 -0.242206 0.185799 -0.062003 0.074037 0.449562 -0.075197 0.129497 -0.070959 -0.203850 -0.107836 -0.004959 -0.015657 -0.013050
polarizability: 1.57780195e+02 1.23807105e+01 1.07151235e+02 -2.91455926e+00 1.33681874e+00 1.27614552e+02
1716.lowfreq: -7.7926 -0.0003 0.0001 0.0005 5.1644 16.3915 35.7085 46.6738 58.1033
frequency: 35.6278 46.6257 58.0298 69.3812 98.3040 147.0617 149.5162 200.2991 224.8676 243.7740 286.5304 297.7692 311.2228 336.2446 406.6359 413.1633 469.5169 505.7607 574.6024 616.1080 635.9913 670.2404 709.0845 727.0987 742.3673 779.1106 791.2207 843.8881 860.7305 892.3081 922.1007 944.4575 964.6618 984.2956 988.8150 990.4062 1002.7664 1029.6206 1040.1970 1047.2907 1081.7337 1101.8549 1132.3640 1164.7589 1172.6980 1194.9162 1198.6458 1229.8148 1245.9514 1274.9168 1282.6397 1324.8945 1333.9840 1351.7913 1371.9881 1389.7830 1391.4107 1398.0620 1443.1086 1465.8097 1476.4280 1479.3844 1482.5580 1484.7199 1495.9128 1590.8573 1611.5889 1652.5439 2960.4112 2975.9916 2978.1398 2993.5114 3031.4102 3043.7229 3067.0187 3070.5796 3079.9630 3086.7273 3113.4427 3126.2161 3139.4453 3153.1722 3164.5294 3498.4613
redmass: 4.5954 3.7280 2.3845 3.4002 3.6079 4.2129 4.5629 1.0311 3.6211 1.4818 2.5259 3.7871 4.0390 4.1677 2.8796 2.1633 3.2943 3.1692 3.7754 6.2527 1.4274 4.3423 1.9216 3.6652 2.1506 1.4206 1.9516 3.5609 1.2549 2.9599 1.6733 1.7217 1.2393 1.3700 2.0740 4.4200 1.3111 2.2305 2.6366 2.6980 1.6276 1.7949 2.1805 2.0321 1.0586 1.1234 2.3140 1.4099 1.4834 1.2148 1.3267 1.3598 1.3292 1.4700 2.4338 1.2192 2.7294 1.2091 2.1275 1.0587 1.0465 1.0857 2.0972 1.0674 1.0514 5.9750 5.9408 7.8370 1.0832 1.0365 1.0368 1.0602 1.0844 1.0999 1.0995 1.0990 1.0999 1.0978 1.0873 1.0866 1.0924 1.0952 1.1009 1.0637
irintensity: 1.7944 0.0509 0.8511 0.2142 0.3491 0.2967 1.5421 0.0305 1.2510 0.1197 0.3097 1.7283 0.8871 3.2158 0.0121 0.4442 9.1783 0.4278 51.7942 1.6714 128.7769 9.5364 54.5235 9.6884 42.8703 19.8994 6.3634 2.3123 0.1282 6.9562 2.8631 1.6734 8.9510 0.5897 3.8538 0.5850 0.3440 9.1870 167.0159 154.0052 10.3505 10.0472 14.5239 9.6612 0.2033 0.6490 0.1626 2.1614 2.0035 3.6987 7.2988 3.8726 11.6176 7.7217 14.8985 15.4958 11.0481 14.4160 11.5416 4.4856 12.8912 8.8015 24.3534 16.3024 4.4495 2.0981 10.1155 153.5980 15.3303 38.4616 32.2820 11.6329 8.1653 3.3502 10.1869 69.2985 57.8558 36.0365 8.6490 1.2915 27.3689 16.0005 22.9029 21.5615
temp: 298.150 k
press: 1.00000 atm
elementType: 8 8 6 6 6 6 6 6 6 6 6 6 6 6 1 1 1 1 1 1 1 1 1 1 1 1 1 1 1 1
symmnumber: 1
zpe: 660132.6 jmol-1
zpe.correction: 0.251431 hartree
zpe.thermalcorrener: 0.265845 hartree
zpe.thermalcorrenthalpy: 0.266789 hartree
zpe.thermalcorrgfe: 0.209173 hartree
zpe.sumelectzpe: -616.275081 hartree
zpe.sumelectthermal: -616.260667 hartree
zpe.sumelectthermalent: -616.259723 hartree
zpe.sumelectthermalfe: -616.317340 hartree
dipole: -0.1186 0.2618 1.3026
dipole: 1.3339
quadrupole: -78.0282 -82.7811 -84.0669
quadrupole: 3.9391 -1.2677 1.1457
quadrupole: 3.5972 -1.1557 -2.4415 3.9391 -1.2677 1.1457
hfenergy: -616.5265126 hartree
pointgroup: C01 [X(C12H16O2)]
dipole: 0.0455509 0.1391687 -0.5039725 debye
polarizability: 155.116472|-16.2733614|109.9234176|-4.8642763|-2.1829191|127.5060921 unknown
InChI: InChI=1S/C12H16O2/c1-3-9(2)11(12(13)14)10-7-5-4-6-8-10/h4-9,11,13H,3H2,1-2H3
charge 0 multiplicity 1
30 atoms
O  1.427995 -2.790349 -0.639796
O  1.220821 -1.771595 1.427102
C  1.576024 0.679535 -0.594027
C  0.563071 -0.539119 -0.642584
C  1.713536 1.323684 0.80949
C  -0.868402 -0.126308 -0.276568
C  2.943289 0.262524 -1.187394
C  1.077448 -1.707518 0.183937
C  2.486852 2.66125 0.792186
C  -1.70169 0.369255 -1.313565
C  -1.383242 -0.177898 1.04443
C  -3.015496 0.80953 -1.041428
C  -2.700653 0.256677 1.31594
C  -3.521089 0.754334 0.278134
H  1.122437 1.439182 -1.266637
H  0.558581 -0.886522 -1.691404
H  0.703017 1.503536 1.222017
H  2.208816 0.61119 1.496137
H  3.476356 -0.433579 -0.512389
H  2.82299 -0.240727 -2.164592
H  3.59152 1.143019 -1.339023
H  3.543329 2.527419 0.497253
H  2.48084 3.125903 1.795128
H  2.026031 3.379779 0.087306
H  -1.319954 0.40385 -2.342027
H  -0.755341 -0.564964 1.853544
H  -3.644255 1.186178 -1.856185
H  -3.085419 0.205949 2.340886
H  -4.541958 1.089955 0.492442
H  1.769744 -3.533169 -0.069511
