program: Gaussian 09
title: 000295959
version: EM64L-G09RevD.01
frameworkgroup: C1[X(C12H9ClN2O)]
method: RPBEPBE
basis: SDD
operation: Freq
keyword: #p
keyword: freq=noraman
keyword: PBEPBE/SDD
title: #p freq=noraman PBEPBE/SDD
converged: YES YES NO NO
title: Mulliken charges:
elementType: Cl O N N C C C C C C C C C C C C H H H H H H H H H
charge: -0.056229 -0.262086 -0.472541 0.001995 0.508597 0.222036 0.148768 -0.327713 -0.440464 -0.198157 -0.182004 -0.249690 -0.121066 -0.450377 -0.178523 -0.327614 0.317385 0.314946 0.228165 0.256576 0.256771 0.284674 0.235745 0.239608 0.251195
chargesum: 0.00000
title: Mulliken charges with hydrogens summed into heavy atoms:
elementType: Cl O N N C C C C C C C C C C C C
charge: -0.056229 -0.262086 -0.155156 0.001995 0.508597 0.222036 0.148768 -0.012767 -0.212299 0.058419 0.074767 0.034984 -0.121066 -0.214632 0.061085 -0.076418
polarizability: 2.93383454e+02 -3.21225039e+00 1.44509857e+02 3.88856966e+00 -4.22188716e-01 6.24294970e+01
1716.lowfreq: -3.7572 -0.0015 -0.0013 -0.0006 1.9344 6.3011 33.4781 34.6094 65.0963
frequency: 33.3726 34.5597 65.0772 80.7822 125.8344 158.5084 199.3588 233.1338 286.9142 332.6611 351.4539 380.7998 407.2816 411.3570 420.7406 482.8246 511.0003 606.2891 622.2134 634.5459 644.7441 699.0752 703.4861 707.6395 721.3135 815.4064 816.6812 835.2512 848.3437 865.2487 913.9827 939.8693 960.2363 984.2218 993.5763 999.7570 1005.4948 1023.9475 1073.2354 1095.2962 1109.4579 1117.9439 1185.7204 1198.9372 1251.0560 1260.2340 1297.1901 1312.7868 1336.0809 1366.9044 1400.4419 1406.9543 1456.5242 1479.3856 1507.0389 1544.2420 1581.7023 1592.5075 1605.3018 1605.9328 3098.5824 3121.3970 3139.8204 3157.2146 3167.2343 3174.6781 3175.6152 3198.0249 3529.6049
redmass: 6.9781 4.4044 6.6299 7.6761 5.8263 7.4151 6.0014 7.9732 6.1462 5.1855 6.4344 3.0990 8.6904 3.1101 4.9662 6.1107 2.7181 7.8282 6.5501 2.3614 1.9209 5.8162 6.6378 3.9473 1.7886 3.2063 1.6722 1.9096 1.4087 6.6867 1.4514 1.3579 1.4527 1.3159 4.2941 3.5637 1.4469 3.9217 2.8256 2.5070 1.5895 1.3870 1.1134 1.3815 3.1755 1.8807 1.3888 11.0826 1.3169 5.0630 4.3599 1.9880 2.0126 2.4893 2.3391 5.3664 5.9850 8.2114 4.2799 5.8524 1.0908 1.0904 1.0889 1.0918 1.0912 1.0951 1.1001 1.0955 1.0762
irintensity: 0.4940 2.7502 1.9590 4.8682 3.0530 3.5447 0.2056 1.9243 15.0193 2.2255 0.0329 0.5357 16.8524 0.9156 7.2533 3.8065 39.2531 4.5537 0.7653 15.8333 27.6054 6.9026 16.7353 0.3334 63.5395 12.9872 44.4784 23.8456 62.6988 9.0886 4.1095 1.3069 0.6925 3.6584 32.3889 12.7234 1.5098 0.2752 57.1620 5.8244 26.3443 15.7595 1.7824 1.2168 29.7469 55.6387 27.7619 3.0539 2.3830 142.4828 16.9692 20.3226 19.4258 154.9234 457.2163 1.9397 17.1729 78.3601 49.3652 28.9440 29.8042 12.6365 6.4531 9.5938 2.2482 2.5249 18.8980 8.5612 11.9859
temp: 298.150 k
press: 1.00000 atm
elementType: 17 8 7 7 6 6 6 6 6 6 6 6 6 6 6 6 1 1 1 1 1 1 1 1 1
symmnumber: 1
zpe: 480922.9 jmol-1
zpe.correction: 0.183174 hartree
zpe.thermalcorrener: 0.196496 hartree
zpe.thermalcorrenthalpy: 0.197440 hartree
zpe.thermalcorrgfe: 0.141148 hartree
zpe.sumelectzpe: -1106.362219 hartree
zpe.sumelectthermal: -1106.348897 hartree
zpe.sumelectthermalent: -1106.347953 hartree
zpe.sumelectthermalfe: -1106.404245 hartree
dipole: -2.3779 -1.2068 -1.1118
dipole: 2.8891
quadrupole: -99.2259 -97.9178 -103.4525
quadrupole: -8.7006 4.3444 0.9057
quadrupole: 0.9728 2.2810 -3.2538 -8.7006 4.3444 0.9057
hfenergy: -1106.5453931 hartree
pointgroup: C01 [X(C12H9Cl1N2O1)]
dipole: -0.9307252 -0.4790947 -0.4429762 debye
dipolederiv: -1.0320381 -0.006452 -0.0176473 -0.0317723 -0.1228208 -0.0099689 -0.0207867 -0.0090488 -0.0695171 -0.7353803 -0.1540204 -0.0043992 0.4345247 -0.8917761 -0.0764632 0.0527314 -0.0507326 -0.351703 -1.776824 0.2900113 0.0408649 0.583063 -0.4413645 0.0004672 0.1124935 0.0092414 -0.2989515 -0.5301244 -0.0107005 -0.0337874 -0.0158145 -0.303073 0.0187857 -0.0417692 0.0258074 -0.2532944 1.2183729 -0.0623552 0.0112695 0.1590179 -0.0179687 -0.0180796 0.0070458 -0.0156706 0.0963426 -0.3041925 -0.0880226 -0.0198306 -0.0449658 -0.1956148 0.0352485 -0.0677744 0.0479233 0.0029336 1.84654 -0.0335645 -0.0362368 -0.9284936 1.15027 0.1393321 -0.1323506 0.0900283 0.2324385 -0.1954172 0.0121559 0.0025169 -0.0582898 -0.0368138 0.0201518 -0.0075655 0.0147938 -0.1506547 -0.1506512 0.0043676 0.0006903 0.0740278 0.0387549 0.041261 0.0065513 0.036946 -0.1907855 -0.2743841 0.027613 0.0014461 0.1153572 0.0617305 0.0259361 0.0176994 0.0238557 -0.0917509 -0.2935459 -0.0092739 -0.0039127 -0.1575807 0.0460914 0.0185795 -0.0261263 0.0202277 -0.089559 0.0656435 0.07843 -0.0021168 -0.0779073 0.0987338 -0.0565961 0.0088555 -0.0259638 -0.0702695 1.3322282 0.0318016 0.0295538 0.0774785 0.0375954 0.0207942 0.0353092 0.0203604 -0.0803532 0.1476728 0.0138282 0.0534023 -0.0180983 0.1820729 -0.0879638 0.1275095 -0.0767266 -0.0239981 -0.0931769 -0.1594013 0.0412359 -0.3050187 -0.1040232 -0.0189014 0.0487128 -0.0280453 -0.0919117 0.3168522 0.0275862 0.0471993 0.1564555 0.1675661 -0.0460125 0.0037443 -0.0618951 -0.0435037 0.2261199 -0.0025788 -0.0024061 -0.0538331 0.1020526 -0.0308694 -0.0252528 -0.026446 0.2893293 0.1751154 0.0501145 0.0068943 0.0144436 0.0768158 -0.0170151 0.006558 -0.0111007 0.1794001 0.0022703 -0.108511 -0.0197767 -0.0931511 -0.0286989 -0.0347025 -0.0185291 -0.030668 0.1611813 0.0488032 -0.0557381 -0.01185 -0.0664091 0.0021472 -0.0266837 -0.0135478 -0.0256939 0.1562304 0.0412841 0.0674892 0.0092791 0.0692445 0.0061598 -0.0244809 0.0099477 -0.0237256 0.1618305 0.1617853 -0.0519753 0.010587 -0.0170211 0.0239527 0.0366787 0.0391183 0.0222539 0.1410644 -0.0489768 0.0942239 -0.0463186 0.1315967 0.0342444 0.0377908 -0.0811784 0.0152605 0.1071743 -0.0333724 0.0779435 -0.0372458 0.1051342 0.025891 0.0458441 -0.0462949 0.0410915 0.1443253 -0.114604 -0.0329712 -0.0194113 -0.0519882 0.0880755 0.0068676 0.0048988 0.0179272 0.1340018 unknown
polarizability: 293.3122477|-2.8617519|144.490143|5.8940716|-0.8629703|62.5204174 unknown
InChI: InChI=1S/C12H9ClN2O/c13-10-3-5-11(6-4-10)15-12(16)9-2-1-7-14-8-9/h1-8,15H
charge 0 multiplicity 1
25 atoms
Cl 6.125946 -0.008271 0.057046
O  -0.624696 1.895354 0.143748
N  0.077341 -0.33465 -0.095528
N  -4.024342 -1.569713 0.293243
C  1.493324 -0.196728 -0.052805
C  -2.319993 0.173307 -0.008702
C  -0.893592 0.659841 0.025691
C  2.148309 1.047046 0.15874
C  2.267487 -1.375979 -0.230451
C  3.558227 1.097222 0.192442
C  3.674645 -1.324813 -0.198351
C  -3.330628 1.111531 -0.341861
C  4.304204 -0.082738 0.014186
C  -2.727543 -1.147337 0.320987
C  -4.675147 0.693082 -0.371988
C  -4.975045 -0.65511 -0.061808
H  -0.260828 -1.282661 -0.275293
H  1.554378 1.95287 0.288455
H  1.772845 -2.341793 -0.393952
H  4.066093 2.052212 0.355337
H  4.26736 -2.23334 -0.3353
H  -3.036171 2.142796 -0.560729
H  -2.008755 -1.905309 0.660485
H  -5.478615 1.389647 -0.629477
H  -6.006102 -1.024767 -0.086113
