program: Gaussian 09
title: 000295958
version: EM64L-G09RevD.01
frameworkgroup: C1[X(C12H16ClNO2)]
method: RPBEPBE
basis: SDD
operation: Freq
keyword: #p
keyword: freq=noraman
keyword: PBEPBE/SDD
title: #p freq=noraman PBEPBE/SDD
converged: YES YES NO NO
title: Mulliken charges:
elementType: Cl O O N C C C C C C C C C C C C H H H H H H H H H H H H H H H H
charge: -0.081853 -0.263258 -0.257377 -0.432557 -0.381237 -0.342718 -0.293478 0.349262 -0.686092 0.485276 -0.359669 -0.340295 -0.428860 -0.350276 0.245444 -0.669469 0.210558 0.210921 0.194373 0.193989 0.203855 0.203749 0.212516 0.212518 0.218366 0.252872 0.249803 0.227774 0.302572 0.320532 0.296344 0.296414
chargesum: 0.00000
title: Mulliken charges with hydrogens summed into heavy atoms:
elementType: Cl O O N C C C C C C C C C C C C
charge: -0.081853 -0.263258 -0.257377 -0.112025 0.040242 0.045644 0.114126 0.349262 -0.042693 0.485276 -0.106797 -0.090492 -0.201086 -0.047704 0.245444 -0.076711
polarizability: 2.59427618e+02 4.22202494e+00 1.53503983e+02 3.94860021e-01 -1.93931982e-01 8.29148663e+01
1716.lowfreq: -27.1616 -3.8284 -3.2366 0.0013 0.0015 0.0016 15.8576 33.6859 47.8531
frequency: -6.3688 31.2675 47.2760 48.8233 70.0273 80.6625 99.4228 109.4547 144.4932 150.7017 193.3491 230.1507 240.7484 246.2695 339.2563 366.2866 372.3822 404.1635 415.3808 447.8194 510.2204 518.7511 566.9365 621.0215 629.4618 674.8936 718.8354 731.7166 740.0428 779.8288 809.5739 821.8547 840.3002 848.7049 902.5687 904.0962 937.7129 942.1493 945.8039 969.2391 972.7931 1000.5739 1041.3939 1084.0171 1121.0414 1126.4742 1146.5548 1146.9196 1181.3294 1212.6853 1213.2549 1225.5241 1254.1257 1266.3562 1271.4584 1279.9067 1282.8058 1311.7367 1343.9409 1373.8879 1384.6853 1392.9420 1418.8045 1425.9535 1467.4230 1471.8281 1479.3028 1481.6457 1489.3657 1503.7468 1532.1630 1597.7071 1604.1770 1629.2750 2945.1074 2966.1316 2976.3538 2993.6671 3002.2838 3010.3883 3058.8385 3069.5304 3075.0008 3076.6966 3121.4129 3151.8749 3161.0658 3169.0892 3190.6424 3461.0905
redmass: 4.0851 2.0669 4.1491 4.5099 3.6168 3.3987 8.3941 3.4356 2.0131 5.4720 5.5360 4.6959 1.0951 5.6446 6.2907 6.2376 5.4124 4.0245 3.0733 6.0481 4.1006 2.5435 3.0650 6.4756 7.0870 6.4977 1.9668 1.5893 1.0764 6.1763 1.1641 1.2806 1.5702 5.9091 1.7043 1.8060 1.1491 6.6678 1.3661 6.8219 1.3175 2.6531 3.4593 2.1813 1.7650 1.6931 1.4590 1.1124 1.2608 3.1561 1.3713 3.1859 1.2001 1.9333 1.3607 1.1706 1.0689 1.4412 1.4832 2.2120 2.2991 1.2376 1.1754 3.2310 1.0778 1.0834 1.0421 1.1066 1.1180 2.2059 2.3361 4.1892 8.2605 6.2315 1.0549 1.0588 1.0361 1.0591 1.1052 1.1018 1.1045 1.0564 1.1013 1.0995 1.0901 1.1095 1.0893 1.0948 1.0953 1.0764
irintensity: 0.2851 0.0413 0.9051 0.6644 0.0027 19.0354 0.2874 0.4947 2.4852 5.8329 0.9242 2.9216 0.0576 1.8951 6.5041 2.0182 1.7939 1.0502 0.0477 21.7677 17.7989 23.6132 3.4060 4.1459 0.6590 100.4486 21.1918 24.6599 11.2190 18.7701 0.1603 21.1200 94.2722 0.8697 11.1683 21.0243 0.1363 2.8553 1.1336 69.3179 4.0820 7.9859 24.8939 8.3970 4.4461 20.0435 1.9237 0.3265 98.9459 36.9628 0.0129 258.3482 20.7855 6.9942 9.3258 0.3622 0.0712 4.6024 0.1501 34.1586 11.3013 6.4554 43.1519 16.2513 3.8496 5.5561 13.1166 55.1496 37.0447 135.9011 422.1243 18.9024 288.3794 26.3991 29.4634 34.3200 37.0468 37.6035 28.7087 2.6613 22.2894 6.2395 98.9929 49.5121 15.8606 1.0766 12.4356 4.8754 5.1995 71.9323
temp: 298.150 k
press: 1.00000 atm
elementType: 17 8 8 7 6 6 6 6 6 6 6 6 6 6 6 6 1 1 1 1 1 1 1 1 1 1 1 1 1 1 1 1
symmnumber: 1
zpe: 679578.3 jmol-1
zpe.correction: 0.258838 hartree
zpe.thermalcorrener: 0.274965 hartree
zpe.thermalcorrenthalpy: 0.275909 hartree
zpe.thermalcorrgfe: 0.213149 hartree
zpe.sumelectzpe: -1130.934529 hartree
zpe.sumelectthermal: -1130.918401 hartree
zpe.sumelectthermalent: -1130.917457 hartree
zpe.sumelectthermalfe: -1130.980218 hartree
dipole: -1.8385 -0.5046 0.0220
dipole: 1.9066
quadrupole: -90.4092 -105.2293 -104.6137
quadrupole: -6.1375 0.1142 -0.0721
quadrupole: 9.6749 -5.1452 -4.5296 -6.1375 0.1142 -0.0721
hfenergy: -1131.1933664 hartree
pointgroup: C01 [X(C12H16Cl1N1O2)]
dipole: 0.7360244 -0.0896966 0.1134601 debye
polarizability: 258.1757686|11.6775832|135.4189102|9.8223609|-30.5200638|102.251789 unknown
InChI: InChI=1S/C12H16ClNO2/c1-2-3-8-16-11-6-4-10(5-7-11)14-12(15)9-13/h4-7,14H,2-3,8-9H2,1H3
charge 0 multiplicity 1
32 atoms
Cl -5.989171 -1.624638 0.427025
O  2.47063 -0.593038 0.631382
O  -3.695875 1.358874 -1.15638
N  -3.161853 -0.584611 0.075296
C  4.768672 0.121274 0.388851
C  5.761301 1.171189 -0.163062
C  3.316494 0.474232 0.061626
C  1.084501 -0.49895 0.444195
C  7.229074 0.815531 0.157124
C  -1.739021 -0.510139 0.173868
C  0.32077 -1.556332 1.001008
C  0.428218 0.551212 -0.244086
C  -1.075701 -1.560205 0.866379
C  -0.97725 0.547919 -0.380416
C  -4.018482 0.292298 -0.543217
C  -5.515807 -0.032704 -0.502288
H  4.999613 -0.875095 -0.03435
H  4.879632 0.0378 1.48701
H  5.521729 2.167557 0.261275
H  5.634663 1.259678 -1.261456
H  3.033415 1.450571 0.508463
H  3.157417 0.526977 -1.036116
H  7.391875 0.750169 1.249211
H  7.504127 -0.161493 -0.282269
H  7.924296 1.575208 -0.244005
H  0.841466 -2.359574 1.530362
H  0.994054 1.379546 -0.680118
H  -1.656353 -2.383818 1.300665
H  -1.485441 1.355417 -0.910943
H  -3.609046 -1.395279 0.519792
H  -5.893786 -0.161277 -1.527038
H  -6.055958 0.780704 0.003612
