program: Gaussian 09
title: 000295954
version: EM64L-G09RevD.01
frameworkgroup: C1[X(C10H10ClNO3)]
method: RPBEPBE
basis: SDD
operation: Freq
keyword: #p
keyword: freq=noraman
keyword: PBEPBE/SDD
title: #p freq=noraman PBEPBE/SDD
converged: YES YES NO NO
title: Mulliken charges:
elementType: Cl O O O N C C C C C C C C C C H H H H H H H H H H
charge: -0.056192 -0.281532 -0.299855 -0.253696 -0.454881 0.343383 0.039489 -0.333340 -0.305615 -0.220333 -0.243612 0.217841 0.246573 -0.681394 -0.497070 0.315323 0.275273 0.401885 0.234880 0.235858 0.294243 0.294441 0.246445 0.246641 0.235246
chargesum: 0.00000
title: Mulliken charges with hydrogens summed into heavy atoms:
elementType: Cl O O O N C C C C C C C C C C
charge: -0.056192 -0.281532 -0.299855 -0.253696 -0.052996 0.343383 0.039489 -0.018017 -0.030342 0.014547 -0.007754 0.217841 0.246573 -0.092710 0.231262
polarizability: 1.81955464e+02 3.01408271e-01 1.79202228e+02 -1.22757191e-01 -1.80040824e-02 6.10108199e+01
1716.lowfreq: -6.5444 -0.0018 -0.0014 -0.0013 5.3786 5.9606 21.9829 51.2063 75.8831
frequency: 21.7154 51.2038 75.8797 87.5467 97.7019 104.1744 133.7387 152.7173 183.9532 204.6789 278.3107 284.4075 327.1155 370.1225 412.0163 436.8653 450.0770 513.8026 516.9122 577.8461 638.9083 672.4563 680.9268 702.8385 763.1312 775.3531 788.8377 843.9182 901.1733 907.0607 917.4999 944.4512 958.7271 983.9789 1010.9954 1044.9742 1060.9112 1113.8812 1132.8749 1151.2043 1164.1433 1178.5156 1221.0252 1233.6275 1266.4407 1272.2503 1307.9559 1382.5706 1418.8792 1424.6977 1440.1194 1452.5530 1461.9151 1464.3028 1516.3866 1577.6590 1585.0945 1606.2835 1630.5046 3008.4322 3066.2246 3111.8109 3139.0818 3145.2423 3153.4404 3159.6141 3183.5221 3191.8418 3194.9070
redmass: 6.0660 6.6139 2.9743 8.7894 2.6012 1.5695 2.9850 6.4820 4.6250 5.4749 9.3612 4.6188 4.6233 11.0149 10.7303 3.6906 6.6526 6.4857 3.2976 3.2186 6.2437 6.3571 5.0732 6.5106 2.9073 5.9274 1.6135 6.0435 1.6925 1.3934 8.3204 6.1848 1.1373 1.3673 1.3202 2.5839 3.9447 1.2608 1.8202 1.5179 1.1055 1.0767 3.1580 2.1992 1.2075 2.4602 1.9765 8.3966 1.1031 1.3381 2.1325 1.0493 1.3720 1.6596 2.9412 6.7494 7.4131 4.3060 3.7224 1.0294 1.0567 1.1047 1.0874 1.1086 1.1051 1.0932 1.0959 1.0822 1.0954
irintensity: 0.8371 0.5004 10.1509 0.6270 8.0333 0.1919 0.5218 1.9566 4.7082 12.0619 2.2768 0.0041 22.1125 10.3261 3.3046 0.6627 20.5755 5.0248 9.3589 1.4502 9.1441 0.9501 21.1475 71.8682 28.2753 4.1136 48.7379 6.6390 0.2046 2.1456 9.7330 4.3732 94.6265 4.9359 3.0471 28.6177 127.7791 0.0545 30.0431 85.9826 0.5630 2.3664 45.9148 168.7293 5.2499 273.3736 105.7973 49.4747 28.7821 41.6731 32.6002 15.0343 12.2955 19.1873 563.4140 122.2044 339.3363 35.4922 57.8344 35.9101 4.7888 23.2500 6.9929 1.2083 16.8289 16.6829 4.8019 209.3304 14.7684
temp: 298.150 k
press: 1.00000 atm
elementType: 17 8 8 8 7 6 6 6 6 6 6 6 6 6 6 1 1 1 1 1 1 1 1 1 1
symmnumber: 1
zpe: 485886.8 jmol-1
zpe.correction: 0.185065 hartree
zpe.thermalcorrener: 0.199565 hartree
zpe.thermalcorrenthalpy: 0.200509 hartree
zpe.thermalcorrgfe: 0.141475 hartree
zpe.sumelectzpe: -1126.478789 hartree
zpe.sumelectthermal: -1126.464289 hartree
zpe.sumelectthermalent: -1126.463345 hartree
zpe.sumelectthermalfe: -1126.522378 hartree
dipole: 3.0649 1.0220 0.0294
dipole: 3.2309
quadrupole: -84.2620 -89.2651 -95.1710
quadrupole: 2.3659 -0.1074 0.0131
quadrupole: 5.3040 0.3010 -5.6049 2.3659 -0.1074 0.0131
hfenergy: -1126.6638536 hartree
pointgroup: C01 [X(C10H10Cl1N1O3)]
dipole: -1.267538 -0.0393674 -0.0870683 debye
dipolederiv: -0.2047229 -0.0862343 -0.0033738 0.1373969 -0.6492977 0.0236519 -0.0081944 0.0035115 -0.1480862 -1.3925035 -0.7709373 -0.0627412 -0.4666566 -0.8385713 -0.0192353 -0.0731159 -0.0441481 -0.2942522 -0.8353379 0.0588 -0.0430504 0.1135921 -0.8926222 0.0280907 -0.0448023 0.0234966 -0.3253117 -1.0175717 0.1238837 -0.0560636 -0.5657959 -0.8032726 -0.0302501 -0.0356676 0.0270083 -0.3546951 -2.0107225 0.2881844 -0.1474731 0.2846014 -0.5785463 0.0323014 -0.1487888 0.033765 -0.284458 0.8825629 -0.1175218 0.0649972 -0.8632887 0.5102387 -0.0813563 0.0901137 -0.0223652 0.1165879 -0.3046594 -0.0580457 -0.0185689 -0.3871833 -0.7577755 -0.0076032 -0.0076477 0.0183246 -0.0497868 -0.155582 0.0941062 -0.0028478 0.4249118 -0.3780359 0.0409178 -0.0138137 0.0146843 -0.1590187 -0.0346839 -0.1523043 0.0100998 0.2933444 0.2356078 0.0124128 -0.0043243 -0.0230015 -0.0991364 0.2997928 0.0614175 0.0311561 -0.0513202 0.2202202 -0.0149972 0.0348785 -0.0061961 -0.1160965 -0.2207597 -0.1961953 0.0028195 -0.2976832 -0.1696305 -0.0237274 0.0059868 -0.0157265 -0.175834 1.7020977 0.6241138 0.0957521 0.4156952 1.6057283 -0.0115612 0.1024631 0.0055484 0.2560222 2.1438247 -0.4300462 0.1669744 0.5992063 0.7516118 0.0273341 0.1393691 -0.0585435 0.2078414 -0.0181016 0.3891434 -0.0228891 0.0527331 0.6610804 -0.0055256 -0.0171539 0.0247368 0.1393046 0.4210467 0.221685 0.004408 0.3524178 0.6070095 0.0168051 0.0009317 0.0069207 0.27474 0.1033415 -0.0762478 -0.0036505 -0.0332901 0.1444523 -0.0014883 -0.0051402 -0.0048133 0.1799546 -0.0112465 -0.028604 -0.0120798 -0.0357353 0.1220249 -0.0018346 -0.0118946 -0.0012476 0.1521555 0.4859587 0.0235022 0.0142512 0.1586175 0.3547222 0.0106593 0.0092167 0.0002536 0.2917088 0.0865176 -0.0451399 -0.0035219 -0.0240449 -0.1060682 0.0063266 -0.0041323 0.0046167 0.1488638 -0.0249874 0.112145 -0.0186942 0.0912073 -0.0094678 0.0128633 -0.0179859 0.0145423 0.1637939 0.0640908 -0.0232329 -0.0584775 -0.0258554 -0.0154968 -0.0228329 -0.0829154 0.0120664 0.0118157 0.0370937 -0.0178807 0.0646828 -0.0270814 -0.0145057 0.0195158 0.0895741 -0.0151942 0.0400893 0.076064 0.0222916 -0.0745732 -0.0833084 -0.0301044 0.0425779 -0.025293 0.0794133 -0.0635455 0.0559875 0.041374 0.0920143 -0.0720816 -0.0379806 -0.0558771 0.0497602 -0.0747382 -0.0338044 -0.1274995 -0.0582566 -0.0191504 0.0096013 0.0686794 0.0028325 -0.0214238 -0.002914 0.1211477 unknown
polarizability: 181.1275565|-0.2095916|179.1485341|9.5971608|-3.7015033|61.8924208 unknown
InChI: InChI=1S/C10H10ClNO3/c1-15-10(14)7-4-2-3-5-8(7)12-9(13)6-11/h2-5,12H,6H2,1H3
charge 0 multiplicity 1
25 atoms
Cl 2.697529 -2.891926 0.424567
O  -2.914858 -1.435329 -0.052427
O  -0.709349 -2.120319 0.145673
O  3.093791 1.158989 0.340508
N  1.181728 -0.23322 0.234471
C  0.138948 0.7224 0.12032
C  -1.225419 0.267875 0.026816
C  0.400358 2.121317 0.095901
C  -2.27296 1.221787 -0.086771
C  -0.659737 3.040171 -0.017729
C  -2.002011 2.600114 -0.109828
C  -1.552377 -1.177447 0.04776
C  2.535329 0.01721 0.334287
C  3.485456 -1.178772 0.454904
C  -3.297747 -2.867975 -0.036739
H  1.433933 2.462708 0.167165
H  -3.298983 0.851852 -0.156075
H  0.858407 -1.224598 0.241151
H  -0.432322 4.111863 -0.034207
H  -2.820003 3.321841 -0.197743
H  4.029171 -1.106151 1.408546
H  4.198645 -1.151351 -0.382081
H  -2.977981 -3.337131 0.908433
H  -2.826462 -3.397497 -0.881247
H  -4.392483 -2.863112 -0.129455
