program: Gaussian 09
title: 000295944
version: EM64L-G09RevD.01
frameworkgroup: C1[X(C16H15N3O2)]
method: RPBEPBE
basis: SDD
operation: Freq
keyword: #p
keyword: freq=noraman
keyword: PBEPBE/SDD
title: #p freq=noraman PBEPBE/SDD
converged: YES YES NO NO
title: Mulliken charges:
elementType: O O N N N C C C C C C C C C C C C C C C C H H H H H H H H H H H H H H H
charge: -0.248933 -0.250249 -0.454553 -0.109660 -0.126057 0.487466 -0.622713 -0.335608 -0.427308 0.180871 0.157844 -0.349460 -0.268810 0.285604 0.179026 -0.763129 -0.343018 -0.297899 -0.204557 -0.201561 -0.238327 0.364232 0.274668 0.268563 0.308474 0.235265 0.250671 0.275812 0.245781 0.263919 0.252581 0.249381 0.275059 0.229679 0.227485 0.229459
chargesum: 0.00000
title: Mulliken charges with hydrogens summed into heavy atoms:
elementType: O O N N N C C C C C C C C C C C C C C C C
charge: -0.248933 -0.250249 -0.090321 -0.109660 -0.126057 0.487466 -0.079481 -0.027134 -0.192043 0.180871 0.157844 -0.098789 0.007002 0.285604 0.179026 -0.000848 -0.093636 -0.022840 0.025122 0.025924 -0.008869
polarizability: 5.27766150e+02 -2.71941295e+01 1.95071549e+02 3.86487113e+00 6.53777786e+00 8.88018104e+01
1716.lowfreq: -1.8413 -0.0007 -0.0006 0.0009 1.8082 5.3615 19.5446 25.9602 37.6222
frequency: 19.5380 25.8941 37.6209 46.2527 62.0461 72.7578 89.6528 101.4693 133.3042 143.6821 163.8627 197.6603 228.4242 272.6204 278.2082 320.2809 341.2789 378.9477 391.1079 407.1381 423.6084 448.2521 494.8747 501.5813 516.7997 550.4220 560.9786 581.4568 608.9448 622.0244 630.7013 692.6053 696.4234 746.1941 783.1207 803.8002 816.4666 831.5101 839.7673 853.5004 873.9752 884.2941 899.1101 911.2729 931.8369 941.4791 981.4684 985.5392 986.1152 987.2822 998.1610 998.7263 1001.4300 1014.6687 1024.9097 1074.8630 1112.7560 1138.6637 1157.2589 1165.0937 1169.6867 1181.5625 1187.6995 1212.0144 1237.4701 1276.9666 1297.3957 1305.0445 1314.1762 1351.2209 1374.8619 1378.9732 1389.7934 1414.9969 1433.5462 1440.3356 1443.4885 1452.0140 1464.3057 1488.2496 1538.4409 1582.1168 1585.5299 1601.9021 1602.4006 1616.3529 1646.6964 2972.0832 2982.9895 3065.2801 3079.0148 3122.4270 3127.1598 3128.5867 3138.3286 3152.1484 3156.6818 3165.1058 3169.9240 3171.7977 3198.5198 3271.2561
redmass: 3.9763 4.6648 3.6259 5.5695 4.4373 3.5675 6.4155 4.3213 4.6795 1.2594 7.2323 6.1205 6.9410 5.2055 4.5082 4.5232 6.9645 4.0493 5.0419 2.9114 3.4496 2.5894 5.4575 3.0470 6.5550 3.0066 4.0388 3.5591 6.4829 5.8086 6.9695 1.8799 5.5904 3.4666 1.8108 4.4667 2.0943 2.5967 1.8621 1.2465 1.4922 2.5546 7.3365 1.2908 3.8854 1.4427 1.8953 6.1898 1.3518 1.3682 1.6290 1.9349 1.3233 2.0732 1.8328 1.4916 1.3308 2.1112 1.2500 1.7434 1.0602 1.6065 1.5233 3.5078 2.9481 2.4722 1.4371 1.4445 1.8389 7.0494 1.2556 5.1832 8.9298 1.0937 4.1698 1.0858 2.4071 1.0568 2.2273 2.5857 2.9527 5.8243 4.5675 6.3271 7.0990 5.9311 3.0471 1.0673 1.0389 1.0951 1.0908 1.0902 1.0850 1.1003 1.0888 1.0931 1.0907 1.0961 1.0942 1.0995 1.0951 1.0812
irintensity: 0.8745 0.1731 2.7400 1.6609 1.1936 7.6414 7.7186 3.4560 0.5216 0.4552 3.7732 7.4234 0.4108 3.4049 5.9556 10.0190 8.2278 2.0717 2.7730 0.0071 0.5599 3.1477 3.2349 0.1648 18.9726 30.5323 37.6381 20.8820 0.2245 8.7692 3.3001 52.6042 3.3580 8.2474 43.7715 2.3934 7.1213 0.7201 5.2276 0.0086 46.8263 15.4096 0.2012 93.2973 11.5612 11.3223 12.9086 0.5793 0.5112 0.0140 0.9311 1.7437 0.6683 10.8231 21.9455 10.7413 22.8068 18.7652 106.5676 26.9654 0.0197 5.5341 1.9900 184.3839 6.1679 130.2257 95.2988 24.9615 62.0499 27.9783 109.3622 83.8854 11.6229 50.6866 38.4230 24.9705 9.4229 20.1024 4.2232 6.9568 941.6216 45.9782 333.2757 3.3500 58.3184 95.3526 161.1647 2.4648 0.9562 8.3767 8.5049 17.8482 2.3935 9.7802 11.0734 25.7164 4.5251 21.3294 5.2841 35.8497 1.3132 528.5098
temp: 298.150 k
press: 1.00000 atm
elementType: 8 8 7 7 7 6 6 6 6 6 6 6 6 6 6 6 6 6 6 6 6 1 1 1 1 1 1 1 1 1 1 1 1 1 1 1
symmnumber: 1
zpe: 727761.5 jmol-1
zpe.correction: 0.277190 hartree
zpe.thermalcorrener: 0.296207 hartree
zpe.thermalcorrenthalpy: 0.297151 hartree
zpe.thermalcorrgfe: 0.226742 hartree
zpe.sumelectzpe: -931.902652 hartree
zpe.sumelectthermal: -931.883635 hartree
zpe.sumelectthermalent: -931.882691 hartree
zpe.sumelectthermalfe: -931.953099 hartree
dipole: -4.0968 -1.7242 -0.1553
dipole: 4.4476
quadrupole: -62.9556 -125.0138 -125.4961
quadrupole: 6.1269 0.5538 0.6580
quadrupole: 41.5329 -20.5253 -21.0076 6.1269 0.5538 0.6580
hfenergy: -932.1798415 hartree
pointgroup: C01 [X(C16H15N3O2)]
dipole: 1.6235088 0.2102078 0.6179592 debye
polarizability: 525.558513|14.0423182|93.3892054|-37.2863671|20.3941179|192.6917901 unknown
InChI: InChI=1S/C16H15N3O2/c1-12(20)11-16(21)17-13-7-9-15(10-8-13)19-18-14-5-3-2-4-6-14/h2-10,17H,11H2,1H3
charge 0 multiplicity 1
36 atoms
O  4.101476 -0.113938 -2.413879
O  5.346803 0.556978 1.637971
N  3.362789 0.423318 -0.238909
N  -2.285131 -0.071934 -0.560062
N  -2.977237 0.147911 0.531953
C  1.956524 0.286982 -0.353652
C  5.781732 0.518108 -0.772668
C  1.298089 -0.054856 -1.567258
C  1.187858 0.516123 0.828156
C  4.325783 0.230284 -1.215626
C  -0.873242 0.068424 -0.408543
C  -0.104242 -0.159515 -1.580073
C  -0.207055 0.409964 0.805644
C  6.168774 0.342906 0.697325
C  -4.395072 0.004417 0.373959
C  7.594056 -0.086491 0.979983
C  -5.160369 0.246089 1.545668
C  -5.049577 -0.352317 -0.840328
C  -6.566226 0.134547 1.510036
C  -6.452097 -0.461773 -0.866969
C  -7.216066 -0.219536 0.304213
H  3.746711 0.648527 0.698525
H  5.990386 1.578255 -1.035073
H  6.43757 -0.084897 -1.422655
H  1.888632 -0.233074 -2.467024
H  1.703035 0.776407 1.761301
H  -0.635355 -0.42143 -2.501078
H  -0.8070 0.582484 1.70393
H  8.312622 0.50236 0.380632
H  7.822134 0.015071 2.051718
H  7.725155 -1.145535 0.682795
H  -4.629214 0.517945 2.463966
H  -4.440563 -0.534325 -1.731028
H  -7.15302 0.321978 2.415861
H  -6.959711 -0.735979 -1.79883
H  -8.30795 -0.307081 0.273721
