program: Gaussian 09
title: 000027235
version: EM64L-G09RevD.01
frameworkgroup: C1[X(C19H25NO3)]
method: RPBEPBE
basis: SDD
operation: Freq
keyword: #p
keyword: freq=noraman
keyword: PBEPBE/SDD
title: #p freq=noraman PBEPBE/SDD
converged: YES YES NO NO
title: Mulliken charges:
elementType: O O O N C C C C C C C C C C C C C C C C C C C H H H H H H H H H H H H H H H H H H H H H H H H H
charge: -0.251635 -0.270024 -0.246761 -0.713212 -0.349121 -0.375115 -0.418804 -0.573777 -0.305511 0.512357 -0.428915 -0.386788 0.236525 -0.356060 -0.359376 0.313527 0.191286 -0.293284 -0.557440 0.552114 -0.474513 -0.538579 -0.538384 0.178942 0.234598 0.199258 0.210628 0.217739 0.188136 0.202766 0.208282 0.208454 0.194852 0.230429 0.231656 0.235430 0.245063 0.247346 0.229563 0.212552 0.298053 0.301587 0.218692 0.218919 0.242655 0.215954 0.216510 0.243428
chargesum: 0.00000
title: Mulliken charges with hydrogens summed into heavy atoms:
elementType: O O O N C C C C C C C C C C C C C C C C C C C
charge: -0.251635 -0.270024 -0.246761 -0.113572 0.064418 0.034771 -0.012929 -0.162729 0.097794 0.512357 -0.198486 -0.155133 0.236525 -0.120629 -0.114313 0.313527 0.191286 -0.045938 -0.327877 0.552114 -0.261961 0.141687 0.137509
polarizability: 3.35925920e+02 -9.99880953e+00 2.27944316e+02 -2.83625567e+01 6.24552142e+00 1.33846909e+02
1716.lowfreq: -5.3537 -1.4353 -0.0015 0.0003 0.0011 4.2825 11.6226 16.3020 19.1050
frequency: 11.4534 16.0015 19.0368 28.9663 39.5525 72.0191 85.3923 92.4923 95.6804 110.0584 125.6323 150.8339 153.7083 194.4658 197.6838 207.9483 219.2341 240.7894 260.3408 271.8414 272.9270 299.9449 315.6166 330.9098 338.6843 362.0017 369.4888 385.6480 414.0827 428.8537 450.3249 453.5742 513.1408 516.5798 528.6498 554.5464 595.4798 619.2806 633.4630 707.4475 710.4526 718.1285 724.5698 739.8401 744.9974 781.3829 793.9737 810.1838 818.0894 829.6774 836.9958 877.9893 890.2006 906.8336 923.6576 935.5698 953.1181 961.9397 990.1435 998.1769 1002.1086 1006.9277 1038.8753 1050.5178 1060.3617 1078.1460 1094.1787 1112.0111 1112.5450 1120.9870 1125.4869 1151.5506 1154.7240 1156.2047 1179.1405 1180.8747 1205.8726 1215.6815 1218.0283 1227.1755 1242.5692 1257.4085 1274.3180 1283.1155 1290.8273 1305.9048 1310.4231 1327.3710 1341.8485 1365.7778 1367.8568 1381.8244 1395.2405 1415.7253 1425.7559 1435.8519 1450.1237 1455.3639 1464.9531 1466.0175 1466.0535 1472.4674 1474.2301 1474.5823 1477.3044 1488.2971 1502.0462 1515.7505 1584.9912 1593.3605 1623.9751 1630.8366 1642.0214 2931.8291 2949.9832 2954.8510 2959.3254 2964.1236 2973.5866 2975.5116 2992.7229 3006.4958 3025.8580 3034.8054 3037.8371 3040.5077 3056.7114 3117.5967 3119.1876 3120.7442 3121.6345 3128.2403 3146.0015 3158.8137 3161.7176 3163.4096 3576.1011 3717.2360
redmass: 4.7442 5.2040 3.7730 3.6379 5.0661 3.9516 2.9213 3.0856 3.3085 2.1273 3.4090 3.9672 5.9582 1.8839 3.0562 2.5531 2.6102 1.4034 1.1777 1.5796 2.4742 3.3470 1.0871 3.3457 3.0076 6.0376 3.1354 4.2276 2.9612 4.4440 3.8096 3.0237 3.1622 3.9133 5.9513 2.9021 3.9060 3.1685 6.7186 5.2484 3.9831 2.2523 1.5946 3.9218 1.4329 1.5453 1.6651 2.2891 1.7153 2.0932 1.7489 1.6790 1.5284 2.0184 4.3535 1.4089 2.0519 1.3568 8.6658 3.5975 3.0897 3.1654 1.5702 2.3015 2.0622 1.7985 2.2969 1.2611 1.2603 1.3391 2.1985 1.4666 1.3243 1.3306 1.2473 2.0151 1.2147 2.0064 2.1244 4.1948 1.3814 1.3057 1.5641 1.1077 1.1515 1.2962 1.3269 3.2128 1.4569 1.6233 1.4687 5.0668 4.3867 3.2729 1.6180 1.1694 1.0867 2.1271 1.0512 1.0743 1.0509 1.0857 1.0958 1.0786 1.1086 1.1005 2.4702 2.9138 7.0188 7.4712 6.4894 1.9602 1.9652 1.0550 1.0333 1.0331 1.0633 1.0605 1.0631 1.0663 1.0991 1.0961 1.0960 1.1035 1.1034 1.1037 1.1028 1.0895 1.0985 1.0929 1.0950 1.0886 1.0898 1.0935 1.0940 1.0951 1.0447 1.1041
irintensity: 0.1783 0.7586 0.1432 0.7399 0.5449 8.8860 0.3453 1.0546 5.1316 0.7616 2.5956 3.1999 0.7294 1.5093 1.0272 0.3630 2.8805 0.4326 255.8651 3.5025 1.5650 0.6858 54.0893 0.7493 2.9532 0.1968 7.3545 1.7512 0.0051 0.2472 1.5571 1.1351 14.8402 4.1891 3.8541 16.3343 3.1484 11.4583 0.3095 7.0360 6.1884 1.9852 12.4701 6.6635 10.5594 38.0831 8.9547 23.4934 2.5542 66.9458 42.0680 11.8514 4.0127 8.9250 15.9148 0.5189 35.1890 0.2032 42.0959 27.5880 10.8710 8.8605 5.8325 26.6299 3.9691 7.9895 3.0038 0.2200 0.2638 22.9140 123.5503 8.3992 10.4966 1.0169 53.8862 69.7715 28.4246 102.9718 295.5255 117.0443 4.1307 1.9918 14.0130 1.7551 7.0137 3.4781 1.3623 40.8164 0.9270 1.7159 32.4673 8.3262 14.4582 1.7217 1.8448 10.0208 6.5477 34.3996 12.1510 0.5056 12.3104 69.0372 0.0462 64.3074 47.4834 16.9983 138.1283 265.4281 7.5341 46.1009 32.5792 9.8335 224.9102 46.3920 69.3781 73.5286 8.8081 7.1404 24.2346 73.2998 73.5530 8.1334 15.5064 54.1302 4.4642 53.5560 92.7818 22.0685 24.6597 41.4648 3.5406 24.9020 20.4632 18.8467 11.0320 5.3325 64.9491 17.5330
temp: 298.150 k
press: 1.00000 atm
elementType: 8 8 8 7 6 6 6 6 6 6 6 6 6 6 6 6 6 6 6 6 6 6 6 1 1 1 1 1 1 1 1 1 1 1 1 1 1 1 1 1 1 1 1 1 1 1 1 1
symmnumber: 1
zpe: 1051279.0 jmol-1
zpe.correction: 0.400411 hartree
zpe.thermalcorrener: 0.424700 hartree
zpe.thermalcorrenthalpy: 0.425644 hartree
zpe.thermalcorrgfe: 0.342629 hartree
zpe.sumelectzpe: -1017.671991 hartree
zpe.sumelectthermal: -1017.647703 hartree
zpe.sumelectthermalent: -1017.646758 hartree
zpe.sumelectthermalfe: -1017.729774 hartree
dipole: 3.0412 1.8612 -0.0196
dipole: 3.5656
quadrupole: -100.5871 -113.7490 -143.6749
quadrupole: -5.8700 -11.6394 1.2315
quadrupole: 18.7499 5.5880 -24.3379 -5.8700 -11.6394 1.2315
hfenergy: -1018.0724025 hartree
pointgroup: C01 [X(C19H25N1O3)]
dipole: -1.1628754 0.7246804 -0.3007197 debye
polarizability: 335.195418|-9.3810171|206.8888274|-32.2206268|-38.560118|155.6329 unknown
InChI: InChI=1S/C19H25NO3/c1-21-17-10-7-15(8-11-17)6-4-3-5-13-23-18-12-9-16(20)14-19(18)22-2/h7-12,14H,3-6,13,20H2,1-2H3
charge 0 multiplicity 1
48 atoms
O  -2.641238 -0.576981 -0.264113
O  8.102799 -0.310946 -0.326536
O  -3.431045 1.849923 -1.007176
N  -8.065389 0.925376 0.414977
C  0.1622 -0.978727 0.657584
C  1.661041 -1.026984 0.29026
C  -0.682612 -1.981801 -0.15799
C  2.515537 -0.032617 1.125222
C  -2.180315 -1.910116 0.153397
C  3.989319 -0.056978 0.748596
C  4.52231 0.850313 -0.19764
C  4.871404 -1.024101 1.304388
C  -4.001384 -0.278628 -0.061707
C  5.881222 0.807719 -0.589923
C  6.226362 -1.085232 0.930622
C  6.736132 -0.167585 -0.021729
C  -4.428818 1.026436 -0.462862
C  -4.95405 -1.156537 0.494934
C  -5.774922 1.415434 -0.301658
C  -6.73111 0.520424 0.262123
C  -6.304585 -0.770478 0.658591
C  8.671579 0.613504 -1.307566
C  -3.829293 3.187959 -1.439945
H  0.040219 -1.19006 1.741383
H  -0.235317 0.039801 0.486706
H  2.054973 -2.053995 0.435824
H  1.787995 -0.794876 -0.786489
H  -0.539675 -1.796748 -1.24037
H  -0.337941 -3.017253 0.042636
H  2.392369 -0.279489 2.198982
H  2.103789 0.986204 0.984959
H  -2.740602 -2.69041 -0.404692
H  -2.367247 -2.048441 1.240872
H  3.86605 1.610729 -0.639491
H  4.489696 -1.736591 2.046429
H  6.253981 1.530155 -1.322584
H  6.907307 -1.825886 1.36163
H  -4.65474 -2.160129 0.811007
H  -6.098669 2.415044 -0.609742
H  -7.021539 -1.475783 1.094445
H  -8.367823 1.849995 0.126654
H  -8.752661 0.296479 0.817313
H  8.599437 1.664225 -0.963443
H  8.174737 0.513752 -2.292886
H  9.729596 0.32525 -1.395762
H  -4.215027 3.791036 -0.593744
H  -4.594051 3.145153 -2.241081
H  -2.909299 3.646864 -1.831505
