program: Gaussian 09
title: 000296000
version: EM64L-G09RevD.01
frameworkgroup: C1[X(C18H21NO4)]
method: RPBEPBE
basis: SDD
operation: Freq
keyword: #p
keyword: freq=noraman
keyword: PBEPBE/SDD
title: #p freq=noraman PBEPBE/SDD
converged: YES YES NO NO
title: Mulliken charges:
elementType: O O O O N C C C C C C C C C C C C C C C C C C H H H H H H H H H H H H H H H H H H H H H
charge: -0.262855 -0.267235 -0.288894 -0.274152 -0.237670 -0.440048 -0.505553 -0.572255 0.340181 0.433036 0.142643 -0.356279 -0.444556 -0.524219 -0.456255 0.202884 0.211136 -0.595899 -0.497165 0.200893 0.184439 -0.493698 -0.537795 0.213418 0.211164 0.228966 0.270563 0.227942 0.219235 0.264620 0.240220 0.234122 0.231190 0.255835 0.246510 0.269698 0.260962 0.263743 0.224627 0.236530 0.232944 0.238209 0.231074 0.237747
chargesum: 0.00000
title: Mulliken charges with hydrogens summed into heavy atoms:
elementType: O O O O N C C C C C C C C C C C C C C C C C C
charge: -0.262855 -0.267235 -0.288894 -0.274152 -0.237670 -0.015466 -0.006025 -0.125078 0.340181 0.433036 0.142643 0.148561 0.020757 -0.021874 -0.186557 0.202884 0.211136 -0.334938 -0.233422 0.200893 0.184439 0.200403 0.169235
polarizability: 3.82370254e+02 -1.09463615e+01 2.53962195e+02 -4.97468565e+00 -3.65626447e+00 1.19274041e+02
1716.lowfreq: -36.1169 -6.3119 -0.0006 -0.0002 0.0004 0.6913 4.7623 23.9344 35.2303
frequency: -36.1132 23.6628 35.2198 47.5632 55.7532 77.7830 85.8201 114.3670 125.1525 147.6679 156.4065 165.9451 191.1303 205.0977 209.2451 216.9886 242.9096 260.4770 275.7254 290.5360 311.9980 335.7899 360.2783 378.3530 390.8949 436.0391 443.3391 455.4367 496.0011 525.7658 535.6208 556.7135 567.5513 619.8313 625.7392 644.5415 667.2697 694.5800 703.9682 714.6770 739.3686 756.0508 800.3101 836.9382 846.0693 864.2987 880.8420 890.8064 898.7321 903.0584 913.1274 924.2367 941.6368 981.4839 990.4473 1016.8431 1034.3771 1060.3445 1069.2864 1083.9802 1100.1282 1107.7324 1109.4454 1125.8710 1142.3687 1152.1100 1157.6001 1162.7104 1185.3661 1188.7989 1194.0140 1195.8889 1216.4049 1227.7674 1237.6507 1252.5572 1281.8325 1287.3593 1299.5844 1317.7145 1319.8170 1331.4635 1349.5961 1351.3119 1367.4192 1400.9390 1416.9241 1430.9949 1440.3926 1448.2350 1453.0984 1457.4207 1459.4307 1462.3809 1467.9278 1473.3733 1475.2341 1478.4101 1493.9636 1504.0819 1541.0366 1561.5320 1594.4878 1618.3159 1630.5817 2956.9913 2967.3797 2968.3679 2989.3654 3001.9427 3003.2297 3006.2829 3022.8976 3036.0144 3047.6802 3053.7411 3058.8267 3084.6994 3091.8415 3102.6196 3111.3876 3124.8126 3125.8146 3148.5852 3168.8540 3179.5203
redmass: 2.8890 4.4171 5.1436 5.1246 4.3267 3.0925 3.6207 3.6051 4.0342 4.9149 2.5958 2.4918 1.2816 3.7345 3.6608 1.9473 4.2167 2.8735 1.7487 2.1910 5.7920 4.0958 4.6655 3.0882 7.6763 5.4160 4.2075 3.4163 2.9605 3.3985 2.7096 4.3702 4.7283 3.4762 3.7357 5.2613 4.5005 3.9941 4.2773 5.0269 3.5608 3.5476 4.3197 1.6376 1.8979 1.7255 1.4525 1.6900 2.2519 1.7244 2.9789 2.5164 2.4065 5.2426 4.7384 2.9865 2.6592 1.9774 1.8438 2.5668 2.1746 1.2467 1.2581 2.3815 1.1863 1.4974 1.4056 1.6410 2.5159 1.6079 2.2122 1.5941 1.8881 2.6747 1.8344 1.4658 1.3434 1.3785 2.7380 1.4121 1.4111 1.7417 1.7100 1.7558 3.5920 2.7053 1.6979 1.2097 1.2028 1.0819 1.5377 1.0526 1.1252 1.0809 1.0491 1.1036 1.1042 1.0906 1.0887 2.7188 8.1848 8.7258 4.2874 6.9501 10.8292 1.0663 1.0699 1.0325 1.0612 1.0284 1.0662 1.0679 1.0631 1.0938 1.0919 1.1002 1.1042 1.0976 1.0973 1.1024 1.1050 1.1006 1.1055 1.0912 1.0910 1.0872
irintensity: 6.3368 0.1097 0.5880 0.9894 11.0200 2.0504 0.6183 0.9802 3.2401 5.6684 1.8955 0.4038 0.2625 0.5303 1.2524 0.7300 14.8986 0.6115 0.3813 0.9633 6.4064 2.5628 2.6913 5.4970 1.5175 18.0119 22.8804 4.2232 3.2284 7.7622 8.3659 0.1026 7.6754 24.6090 11.6646 0.4126 6.2103 0.4734 3.5202 2.1850 2.6324 14.9237 21.0495 14.2898 6.9565 3.9149 3.9200 32.6764 7.6760 35.4193 11.8197 13.1117 16.0767 20.0877 29.2830 29.1973 22.9904 4.8889 0.7484 43.3291 12.5425 0.1629 0.1003 93.2480 1.6346 49.5223 110.6497 44.7919 75.0462 100.1495 289.7460 15.2726 38.1110 120.1306 223.4179 106.2925 3.8366 14.3361 335.2912 29.1121 10.7383 53.9950 25.0244 120.7358 23.7647 168.3140 21.1726 9.8197 1.1349 10.0049 10.3991 12.6103 12.3059 41.3663 14.8170 15.8324 77.7261 16.8817 8.9682 121.7457 618.0824 10.2731 456.5982 37.7746 304.6628 31.7001 7.7183 38.2348 43.6723 93.8690 13.7795 27.9738 40.3992 44.3823 22.2198 34.0960 36.1000 21.2837 9.2085 32.3720 34.0025 27.4701 28.9503 9.3127 19.4913 14.1245
temp: 298.150 k
press: 1.00000 atm
elementType: 8 8 8 8 7 6 6 6 6 6 6 6 6 6 6 6 6 6 6 6 6 6 6 1 1 1 1 1 1 1 1 1 1 1 1 1 1 1 1 1 1 1 1 1
symmnumber: 1
zpe: 936354.2 jmol-1
zpe.correction: 0.356638 hartree
zpe.thermalcorrener: 0.377821 hartree
zpe.thermalcorrenthalpy: 0.378765 hartree
zpe.thermalcorrgfe: 0.305732 hartree
zpe.sumelectzpe: -1052.455933 hartree
zpe.sumelectthermal: -1052.434750 hartree
zpe.sumelectthermalent: -1052.433806 hartree
zpe.sumelectthermalfe: -1052.506840 hartree
dipole: -1.0159 -2.6112 0.2245
dipole: 2.8108
quadrupole: -111.9499 -126.9538 -135.5394
quadrupole: 4.4520 1.2898 -1.4729
quadrupole: 12.8644 -2.1395 -10.7250 4.4520 1.2898 -1.4729
hfenergy: -1052.8125715 hartree
pointgroup: C01 [X(C18H21N1O4)]
dipole: -0.2608599 -1.0619999 0.1644429 debye
polarizability: 382.926931|7.1501475|251.8580644|4.8519804|-14.7189773|120.821495 unknown
InChI: InChI=1S/C18H21NO4/c1-22-15-9-12-5-3-6-13(14(12)11-16(15)23-2)10-18(21)19-8-4-7-17(19)20/h9-11H,3-8H2,1-2H3
charge 0 multiplicity 1
44 atoms
O  -2.030345 -2.412157 0.042633
O  5.25033 0.199817 -0.225547
O  3.312574 -1.960167 0.307903
O  -3.381735 1.714785 -0.353249
N  -3.571042 -0.597323 -0.269802
C  0.40802 3.834995 0.171034
C  -0.741392 2.887678 -0.224837
C  1.674009 3.506376 -0.645428
C  -0.359438 1.41086 -0.222081
C  2.078306 2.060734 -0.410222
C  1.079733 1.06254 -0.179893
C  -5.053261 -0.431495 -0.330108
C  -5.571087 -1.858266 -0.639126
C  -4.487597 -2.781476 -0.037712
C  -1.314313 0.406978 -0.284842
C  -3.198574 -1.949716 -0.085394
C  -2.759024 0.601948 -0.302614
C  3.435687 1.688913 -0.405913
C  1.514443 -0.273246 0.070701
C  3.866236 0.360548 -0.180928
C  2.869215 -0.642811 0.069375
C  5.920058 -1.084204 0.055284
C  2.286724 -2.981964 0.545426
H  0.632201 3.729405 1.250634
H  0.095677 4.882378 0.001602
H  -1.101059 3.145032 -1.243708
H  -1.629555 3.033979 0.414159
H  2.508462 4.181337 -0.380473
H  1.460827 3.673021 -1.722855
H  -5.311364 0.316772 -1.094663
H  -5.420246 -0.05013 0.641392
H  -5.63259 -2.008084 -1.731441
H  -6.573919 -2.030591 -0.215603
H  -4.34189 -3.730727 -0.577562
H  -4.694668 -3.032568 1.020796
H  -1.002385 -0.637688 -0.31991
H  4.215554 2.437869 -0.578755
H  0.767837 -1.039143 0.290768
H  6.991291 -0.85074 -0.046759
H  5.61973 -1.857059 -0.670143
H  5.695719 -1.434948 1.075868
H  1.601084 -3.074485 -0.318172
H  1.700091 -2.759916 1.457256
H  2.846077 -3.91936 0.68171
