program: Gaussian 09
title: 000295937
version: EM64L-G09RevD.01
frameworkgroup: C1[X(C11H25ClN2)]
method: RPBEPBE
basis: SDD
operation: Freq
keyword: #p
keyword: freq=noraman
keyword: PBEPBE/SDD
title: #p freq=noraman PBEPBE/SDD
converged: YES YES NO NO
title: Mulliken charges:
elementType: Cl N N C C C C C C C C C C C H H H H H H H H H H H H H H H H H H H H H H H H H
charge: -0.089418 -0.096804 -0.111675 -0.363692 -0.330263 -0.351815 -0.337746 -0.328821 -0.326128 -0.323678 -0.675261 -0.668579 -0.671075 -0.674274 0.267776 0.229778 0.234105 0.233067 0.215715 0.186082 0.213221 0.183924 0.202008 0.196289 0.212009 0.193119 0.205994 0.228544 0.208319 0.204797 0.231628 0.219137 0.196865 0.221442 0.209597 0.210883 0.222798 0.210221 0.211912
chargesum: 0.00000
title: Mulliken charges with hydrogens summed into heavy atoms:
elementType: Cl N N C C C C C C C C C C C
charge: -0.089418 -0.096804 -0.111675 -0.095916 0.133620 0.096967 0.061557 0.057111 0.082170 0.075436 -0.033602 -0.020948 -0.029154 -0.029344
polarizability: 1.61798862e+02 7.93287233e+00 1.46751053e+02 2.04946209e+00 2.02869359e-01 1.31902834e+02
1716.lowfreq: -8.5529 -3.4898 -0.0018 -0.0012 -0.0012 8.2074 24.8164 27.8539 43.6743
frequency: 24.5617 27.5442 43.5493 57.4500 66.9200 76.3919 81.2609 85.8979 129.9251 147.6155 182.3709 185.3493 202.1242 218.7908 238.5221 268.5695 272.5247 293.6173 327.1984 336.7453 363.3084 382.9380 437.5922 442.5480 464.9526 474.3094 519.5748 614.0743 737.3167 747.3414 793.4656 793.9985 794.7982 796.7178 862.6538 899.0498 918.5531 968.6845 984.0913 994.9621 1049.4720 1062.7510 1071.9665 1075.2391 1078.2741 1083.8579 1086.7071 1098.1185 1107.4812 1118.1060 1154.0176 1159.2089 1203.4781 1207.5653 1218.4821 1251.4376 1270.3171 1285.0841 1288.7935 1290.7664 1296.0480 1306.0467 1355.9147 1357.2968 1363.6738 1366.2449 1371.7520 1373.8193 1385.9099 1387.6567 1388.0874 1392.1412 1448.7634 1459.5950 1461.3617 1462.5488 1468.8909 1470.4447 1472.9854 1476.8043 1478.3324 1480.5483 1485.8550 1486.0341 1490.7385 1491.8135 2841.2792 2850.7954 2863.3213 2871.6962 2895.1983 2925.6114 2982.2527 2982.9733 2983.1090 2984.3359 3010.1505 3025.9440 3032.8184 3036.6812 3047.2166 3049.8148 3074.3238 3075.9245 3077.6401 3077.8595 3081.7062 3086.2213 3089.0214 3091.0514 3096.2744
redmass: 3.7724 3.2646 3.3773 3.2052 2.5617 2.8473 1.9825 2.0333 2.1144 1.8090 2.1809 1.7708 1.4332 1.2798 1.8772 1.7578 1.8839 2.1051 3.3290 2.2852 2.1202 2.8741 2.5179 2.6073 2.9008 2.6927 2.8720 4.1442 2.7022 2.6355 1.1829 1.1506 1.1501 1.1923 1.9514 1.9755 2.0076 1.7159 2.2306 2.1576 2.6399 2.3902 2.2200 1.9490 1.9737 2.2389 2.0201 2.2088 1.9767 1.9581 1.6378 1.4708 2.2861 2.2295 1.6259 1.4711 1.1272 1.1836 1.2307 1.2135 1.2950 1.3204 1.3660 1.3397 1.3357 1.3490 1.3729 1.3620 1.2384 1.2329 1.2382 1.2292 1.0802 1.0598 1.0512 1.0524 1.0551 1.0555 1.0493 1.0575 1.0552 1.0587 1.0707 1.0716 1.0783 1.0751 1.0721 1.0715 1.0720 1.0714 1.0690 1.0695 1.0355 1.0355 1.0358 1.0362 1.0872 1.0879 1.0869 1.0875 1.0882 1.0915 1.0985 1.0981 1.0982 1.0983 1.0892 1.1002 1.1003 1.1002 1.1000
irintensity: 0.0464 0.2785 0.3315 0.5473 0.0862 0.5200 0.3281 0.3164 0.4796 0.7054 1.6831 2.7176 0.1202 0.2014 0.8722 1.9126 0.0790 0.6573 1.5687 2.4801 0.3638 3.7433 7.4665 0.2564 11.5005 2.3900 12.4578 45.7391 9.8765 7.8165 10.5703 3.3933 2.1349 4.4900 3.9549 13.6693 4.3360 24.6717 3.9461 4.5498 18.4513 32.9739 41.6737 24.3370 9.1502 3.9222 1.3310 5.1792 19.0084 4.5888 11.6562 19.2877 32.3360 28.2209 12.8943 8.6216 15.9479 9.4463 32.6054 13.6415 16.8398 7.7743 2.8394 4.8441 3.2334 2.7314 4.8374 0.9847 22.3080 32.3581 10.9997 21.0026 3.9282 2.5479 6.9070 4.1961 6.2371 13.3501 10.3715 2.5376 5.0325 12.3066 10.5033 11.7058 9.9747 13.5290 36.4529 165.9689 40.4408 173.2001 65.7364 68.9012 28.2893 26.3602 35.7084 30.2618 20.3171 12.1812 19.7393 14.6285 14.0744 7.7118 31.5771 26.8150 86.3027 62.0339 37.9108 50.2180 44.9943 40.6234 36.4898
temp: 298.150 k
press: 1.00000 atm
elementType: 17 7 7 6 6 6 6 6 6 6 6 6 6 6 1 1 1 1 1 1 1 1 1 1 1 1 1 1 1 1 1 1 1 1 1 1 1 1 1
symmnumber: 1
zpe: 912341.0 jmol-1
zpe.correction: 0.347492 hartree
zpe.thermalcorrener: 0.366551 hartree
zpe.thermalcorrenthalpy: 0.367495 hartree
zpe.thermalcorrgfe: 0.298211 hartree
zpe.sumelectzpe: -1002.506838 hartree
zpe.sumelectthermal: -1002.487779 hartree
zpe.sumelectthermalent: -1002.486835 hartree
zpe.sumelectthermalfe: -1002.556120 hartree
dipole: 2.4005 1.8250 1.6146
dipole: 3.4206
quadrupole: -91.8408 -100.4112 -97.1491
quadrupole: -3.4764 -3.6150 -4.3548
quadrupole: 4.6262 -3.9442 -0.6821 -3.4764 -3.6150 -4.3548
hfenergy: -1002.8543304 hartree
pointgroup: C01 [X(C11H25Cl1N2)]
dipole: -0.8979392 0.5099002 -0.862992 debye
polarizability: 158.5162802|-9.8997653|146.439019|2.8386014|-7.2098014|135.4974504 unknown
InChI: InChI=1S/C11H25ClN2/c1-5-13(6-2)9-11(12)10-14(7-3)8-4/h11H,5-10H2,1-4H3
charge 0 multiplicity 1
39 atoms
Cl 0.761174 -1.617275 2.448323
N  1.968561 -0.222575 -0.489439
N  -2.190707 0.31847 0.292319
C  0.007178 -0.524733 1.062004
C  0.659493 -0.882244 -0.281941
C  -1.521134 -0.733944 1.097234
C  1.825872 1.134775 -1.080723
C  2.965844 -1.079339 -1.182927
C  -2.427744 1.567575 1.069054
C  -3.401178 -0.156676 -0.431634
C  3.010909 2.06398 -0.756215
C  3.541488 -2.179394 -0.271035
C  -2.462009 2.828823 0.18501
C  -3.076927 -1.042156 -1.649447
H  0.283479 0.494159 1.376942
H  0.780908 -1.978768 -0.334007
H  -0.073173 -0.593336 -1.073429
H  -1.867315 -0.743226 2.155448
H  -1.752989 -1.728569 0.675543
H  1.674651 1.084268 -2.190223
H  0.901426 1.581985 -0.666808
H  2.537569 -1.539577 -2.110715
H  3.795185 -0.428909 -1.515209
H  -3.3708 1.496436 1.666907
H  -1.606054 1.671968 1.802003
H  -4.09708 -0.700324 0.255984
H  -3.946993 0.736515 -0.786064
H  3.136918 2.148557 0.337215
H  3.960316 1.687562 -1.17804
H  2.836795 3.072843 -1.175347
H  4.040699 -1.725143 0.60179
H  2.752306 -2.849323 0.114261
H  4.274032 -2.796184 -0.825434
H  -1.510112 2.934893 -0.364846
H  -3.279572 2.790295 -0.557419
H  -2.615912 3.731491 0.805217
H  -2.439766 -0.491524 -2.363638
H  -2.546526 -1.967842 -1.360629
H  -4.009312 -1.340234 -2.163988
