program: Gaussian 09
title: 000295925
version: EM64L-G09RevD.01
frameworkgroup: C1[X(C8H10N2O2)]
method: RPBEPBE
basis: SDD
operation: Freq
keyword: #p
keyword: freq=noraman
keyword: PBEPBE/SDD
title: #p freq=noraman PBEPBE/SDD
converged: YES YES NO NO
title: Mulliken charges:
elementType: O O N N C C C C C C C C H H H H H H H H H H
charge: -0.387064 -0.259037 -0.061637 -0.411010 0.439715 0.382383 -0.396010 -0.319207 -0.265658 -0.800754 0.215725 -0.780070 0.288019 0.246385 0.307000 0.238708 0.238369 0.228566 0.346438 0.243435 0.262884 0.242820
chargesum: 0.00000
title: Mulliken charges with hydrogens summed into heavy atoms:
elementType: O O N N C C C C C C C C
charge: -0.387064 -0.259037 -0.061637 -0.064572 0.439715 0.382383 -0.107991 -0.072822 0.041343 -0.095111 0.215725 -0.030931
polarizability: 1.71562687e+02 6.22964204e+00 1.22529200e+02 -5.01669421e-03 2.31463988e-02 5.30088880e+01
1716.lowfreq: -59.2639 -7.7978 0.0007 0.0008 0.0008 8.7871 10.3493 60.2577 71.4081
frequency: -59.2342 60.2328 71.3804 87.3172 137.7670 174.5920 222.2552 285.0131 291.5667 336.5659 350.0122 454.9183 486.4911 506.9660 563.6614 568.1936 591.3374 643.1614 715.2200 718.6885 822.2591 828.6058 844.8060 860.0602 923.3252 945.3170 970.8682 991.4237 1015.3727 1034.9457 1048.2180 1106.0064 1144.8643 1197.6712 1239.8928 1263.3162 1292.3784 1340.3379 1378.8773 1382.3695 1404.5457 1446.4110 1464.4930 1468.8896 1469.2927 1487.7515 1529.6481 1559.5689 1611.7074 1632.1757 2983.7912 2992.5119 3064.2374 3077.7905 3092.3127 3138.3431 3153.3418 3199.5559 3202.3093 3290.3209
redmass: 1.0453 1.1656 2.5092 6.2312 4.4715 4.2520 4.6462 3.2589 7.1597 4.0201 4.1376 3.3661 4.3844 4.9722 8.0517 3.4296 3.0976 5.0242 5.0009 6.3075 4.3166 1.2938 1.1669 1.3271 4.1476 3.3740 1.2898 1.6280 1.5228 1.6709 1.5060 2.2251 1.8186 1.7407 3.1511 3.2050 1.8675 3.2619 1.3597 2.4894 1.2318 1.1772 1.0463 1.2140 1.1423 1.6499 3.6523 4.5771 6.4127 7.3469 1.0372 1.0381 1.0981 1.0981 1.0990 1.0987 1.0917 1.0946 1.0942 1.0751
irintensity: 0.6124 1.1489 1.1779 10.3228 12.0915 1.4541 0.1899 3.4498 0.7761 3.5878 0.9934 7.6330 19.1570 1.1400 5.8535 10.2434 2.2660 9.8985 0.1035 1.8105 0.1717 25.1252 106.7613 17.3148 7.6272 27.5161 6.3157 22.2441 13.5792 9.8615 13.6554 26.6774 9.6567 17.4493 73.4318 43.9890 0.0989 31.5782 40.9470 76.3434 5.2508 122.4349 19.1973 42.5675 32.0668 178.1514 507.4979 14.6153 169.7745 27.5901 30.2220 4.6804 16.7180 11.9688 16.8032 8.7907 6.6296 4.0776 1.1963 89.4129
temp: 298.150 k
press: 1.00000 atm
elementType: 8 8 7 7 6 6 6 6 6 6 6 6 1 1 1 1 1 1 1 1 1 1
symmnumber: 1
zpe: 449588.1 jmol-1
zpe.correction: 0.171239 hartree
zpe.thermalcorrener: 0.182143 hartree
zpe.thermalcorrenthalpy: 0.183087 hartree
zpe.thermalcorrgfe: 0.134008 hartree
zpe.sumelectzpe: -569.894889 hartree
zpe.sumelectthermal: -569.883985 hartree
zpe.sumelectthermalent: -569.883041 hartree
zpe.sumelectthermalfe: -569.932119 hartree
dipole: -2.0017 -0.2070 -0.0087
dipole: 2.0124
quadrupole: -53.7245 -79.6994 -72.1868
quadrupole: 9.9918 -0.0269 0.0286
quadrupole: 14.8124 -11.1625 -3.6499 9.9918 -0.0269 0.0286
hfenergy: -570.0661277 hartree
pointgroup: C01 [X(C8H10N2O2)]
dipole: 0.768849 -0.1152415 0.1497102 debye
dipolederiv: -0.4144588 0.2076194 -0.0713118 0.1415871 -0.9524695 0.199295 -0.0522721 0.2095147 -0.4120892 -0.7369227 0.0264739 -0.0651416 -0.6123113 -0.8674147 0.0619831 0.1193472 0.1560345 -0.3696309 -0.1961996 -0.1225056 -0.0052695 -0.29246 0.8434073 -0.2648934 0.0445574 -0.2410839 0.1624685 -2.1046097 -0.1957201 -0.2095244 -0.4080713 -0.4312998 -0.0179908 -0.1470146 0.0134998 -0.3080219 0.3213393 -0.1248447 0.0835188 -0.1048319 -0.0304913 -0.0074907 0.0754326 -0.0097196 0.0099591 1.209892 -0.1848509 0.2180847 -0.3526293 -0.2420238 0.0456258 0.2665228 0.0702481 0.1080352 -0.0795625 0.171156 -0.0415923 0.1500689 0.0348788 -0.0296069 -0.0348843 -0.0264865 -0.1378911 -0.1385723 0.1202822 -0.02899 -0.0713139 0.045623 -0.0771833 0.0276994 -0.0491881 -0.1642779 -0.1672653 -0.0771299 0.0137 0.1826138 0.0673261 -0.0252434 -0.0623497 -0.063302 -0.0993427 -0.09839 0.0338149 -0.0324256 0.1226776 0.0687153 0.0148616 -0.0548734 0.0010413 0.0497244 2.0472689 0.1385758 0.2334615 0.9173358 1.104768 -0.1329872 0.0086442 -0.248122 0.2515176 -0.3391132 0.1412005 -0.0972324 0.2776983 -0.1248278 0.0909552 -0.1410394 0.071798 0.0040878 0.0525222 -0.0246208 -0.011347 -0.0439257 0.0524985 0.0309278 -0.005816 0.0335367 0.1688429 0.0665887 0.0560685 -0.029737 0.0588266 -0.029456 0.0633225 -0.0306819 0.0631901 0.1340428 0.1308331 -0.0564885 0.0097624 -0.0327063 0.1060927 0.0167536 0.0027534 0.0132129 0.1755911 -0.0185549 0.0441547 0.0135136 0.0879137 -0.0134334 -0.1004649 0.0666726 -0.0977821 0.0385887 0.0131127 0.0047345 -0.0177242 0.0126752 0.0923726 0.0749263 -0.0865664 0.0641763 -0.0977531 0.0094213 -0.0413679 -0.0039749 -0.1521901 -0.0662359 0.0282811 0.0272066 0.0452989 0.1051596 0.3487913 -0.0563706 0.0239164 0.1884794 0.2258645 0.0481992 -0.0468753 0.0128706 0.2858244 0.057661 -0.0064755 0.0536808 0.0082433 0.0933981 0.0662624 0.0011461 0.0688765 -0.06696 -0.0300496 -0.0508967 -0.0069083 -0.1148407 0.0409053 0.0109731 0.0132022 0.0194207 0.1266867 0.0662679 -0.0028092 -0.028459 0.0371607 -0.0181979 -0.0965062 0.0091888 -0.1070348 0.0354382 unknown
polarizability: 167.7735641|-5.5185922|117.8367494|18.3834634|-19.7909348|61.490461 unknown
InChI: InChI=1S/C8H10N2O2/c1-6-3-4-8(9-7(2)11)10(12)5-6/h3-5,9H,1-2H3
charge 0 multiplicity 1
22 atoms
O  0.44411 2.077013 -0.938461
O  -2.558917 -1.696106 -0.277481
N  0.882642 0.866738 -0.518712
N  -1.345211 0.265818 -0.667438
C  2.682112 -0.617072 0.178235
C  -0.057848 -0.167094 -0.352453
C  2.220418 0.635832 -0.256624
C  1.732053 -1.661907 0.346486
C  0.366416 -1.437188 0.081957
C  4.157656 -0.83013 0.455307
C  -2.527322 -0.479205 -0.624435
C  -3.765056 0.310946 -1.033745
H  2.86115 1.503752 -0.418002
H  2.060598 -2.649871 0.684595
H  -0.393724 -2.210933 0.199507
H  4.57331 -1.622341 -0.194425
H  4.323474 -1.143909 1.502402
H  4.74218 0.089188 0.28211
H  -1.324287 1.264012 -0.957797
H  -3.675659 0.677322 -2.072925
H  -4.644736 -0.343944 -0.959212
H  -3.911163 1.188078 -0.377088
