program: Gaussian 09
title: 000295918
version: EM64L-G09RevD.01
frameworkgroup: C1[X(C7H10N4OS)]
method: RPBEPBE
basis: SDD
operation: Freq
keyword: #p
keyword: freq=noraman
keyword: PBEPBE/SDD
title: #p freq=noraman PBEPBE/SDD
converged: YES YES NO NO
title: Mulliken charges:
elementType: S O N N N N C C C C C C C H H H H H H H H H H
charge: 0.286711 -0.265458 -0.413079 -0.017290 0.035359 -0.639812 0.090538 0.148492 0.159240 -0.358454 -0.394225 -0.603417 -0.830505 0.284077 0.318800 0.221068 0.278056 0.233795 0.332369 0.340207 0.275191 0.274196 0.244143
chargesum: 0.00000
title: Mulliken charges with hydrogens summed into heavy atoms:
elementType: S O N N N N C C C C C C C
charge: 0.286711 -0.265458 -0.094279 -0.017290 0.035359 0.032763 0.090538 0.148492 0.159240 -0.074377 -0.394225 0.129502 -0.036976
polarizability: 2.11448480e+02 1.43138005e-01 1.28575106e+02 -2.16667493e+00 3.43521308e-02 6.46647679e+01
1716.lowfreq: -9.7224 -5.7992 -2.8654 -0.0010 -0.0009 0.0008 46.7982 63.6387 78.0396
frequency: 46.7966 63.6364 78.0300 94.1614 110.3436 115.8257 155.6160 179.5042 202.6413 247.0935 267.9598 309.0183 334.1409 389.1841 420.6619 434.1235 457.1113 531.0125 559.4299 579.4851 660.0908 664.4201 699.7541 705.6949 725.1413 786.0704 790.7027 897.3299 953.9012 971.3380 977.5965 989.8956 1031.6443 1119.0529 1128.6633 1137.0082 1178.3651 1228.1937 1278.9341 1302.5793 1335.7371 1361.8447 1406.2025 1418.3050 1435.7482 1450.8383 1452.2647 1482.4961 1508.4839 1516.3051 1542.5227 1600.6186 1610.5535 2979.9635 3022.7658 3063.0668 3117.7745 3146.6942 3153.0189 3156.5982 3513.2004 3518.3923 3666.9294
redmass: 4.1611 4.5065 1.1085 3.7408 2.8576 1.2450 3.4886 4.0639 7.0112 6.1032 5.5459 4.3362 4.7148 4.8764 1.3361 3.0944 4.9112 4.4255 5.2359 1.3860 7.8077 7.5783 1.7773 5.0781 3.2196 3.9071 4.7390 5.1272 1.5541 3.5048 1.1808 1.3799 2.3518 1.3029 2.9882 1.7525 4.1559 2.9879 4.3063 2.5471 1.4173 2.2498 3.5458 1.2103 1.0530 1.1558 1.1899 1.1188 1.4245 3.5255 5.6731 4.2001 1.5162 1.0369 1.0282 1.1000 1.0987 1.1039 1.1055 1.0932 1.0464 1.0762 1.1045
irintensity: 1.0225 3.7492 0.2808 5.5000 0.0232 1.6076 1.1628 4.2748 1.7501 5.4096 12.1726 8.7275 9.1300 16.1244 98.1607 43.3815 16.8064 14.8194 17.0759 121.1762 4.6845 5.6404 24.2987 22.0128 20.9080 7.0484 13.1576 19.5210 11.1388 5.1382 8.2480 14.2628 44.4732 11.9782 9.9468 25.5918 244.0407 172.9192 16.8543 37.4656 36.6772 109.6114 90.5500 35.3682 14.3286 78.9842 19.1303 23.4534 36.8550 178.9992 521.0629 392.8630 123.5699 78.1385 23.0661 33.1879 2.4436 10.8355 12.9775 1.9966 65.1726 10.3893 50.1160
temp: 298.150 k
press: 1.00000 atm
elementType: 16 8 7 7 7 7 6 6 6 6 6 6 6 1 1 1 1 1 1 1 1 1 1
symmnumber: 1
zpe: 456150.9 jmol-1
zpe.correction: 0.173739 hartree
zpe.thermalcorrener: 0.187587 hartree
zpe.thermalcorrenthalpy: 0.188531 hartree
zpe.thermalcorrgfe: 0.132415 hartree
zpe.sumelectzpe: -964.083314 hartree
zpe.sumelectthermal: -964.069466 hartree
zpe.sumelectthermalent: -964.068521 hartree
zpe.sumelectthermalfe: -964.124638 hartree
dipole: 1.8545 6.9270 1.0415
dipole: 7.2462
quadrupole: -77.0982 -82.6576 -84.8076
quadrupole: 3.7227 5.9519 -3.0010
quadrupole: 4.4229 -1.1365 -3.2864 3.7227 5.9519 -3.0010
hfenergy: -964.2570529 hartree
pointgroup: C01 [X(C7H10N4O1S1)]
dipole: -0.6719185 -2.7465724 0.3638654 debye
dipolederiv: -0.8710942 0.1187379 -0.009228 -0.0268362 0.100354 0.0185282 -0.0474423 0.0270571 -0.0589224 -0.9184774 0.2756549 -0.0753764 0.2079665 -0.7893963 0.2362079 0.0295283 0.200226 -0.4642808 -0.9350151 -0.2521292 0.2374631 -0.4255191 -0.7778747 0.1218295 0.2260597 0.0215882 -0.4517381 -1.2795025 -0.404315 -0.1108413 -0.5365357 -0.6807323 -0.1015211 -0.1375188 -0.1313352 -0.2135117 -1.527029 0.0532965 -0.0072135 0.6015557 -0.5674649 -0.040596 0.0083514 -0.0348254 -0.1970186 -0.444075 -0.411072 0.002768 -0.4392261 -1.1732835 -0.1065673 0.0527726 0.0099651 -0.6201984 -1.0290591 0.1460312 0.0392558 -0.4128787 -0.6416907 -0.0536838 -0.0435717 -0.0409874 -0.055935 0.8585584 0.3630736 0.0791813 0.3759035 1.3505408 0.2557256 0.1668085 0.2484384 0.2462061 1.8150539 -0.03713 -0.1215401 0.2322506 1.1159944 -0.5360356 -0.2474493 -0.4612006 0.4636265 1.0067254 0.1634944 0.0220807 0.3944016 0.4711997 0.0532504 -0.0301993 0.0477459 -0.0018539 2.0807486 -0.0341271 0.0860381 -0.1211636 0.540029 0.0840927 0.1345711 0.0680338 0.0176295 0.5376295 0.1238075 -0.1429574 -0.0340915 0.12184 0.0991796 -0.0152739 0.1279962 0.171881 0.0956623 -0.1080914 -0.0109225 -0.0964885 0.0831275 0.0020866 -0.0041 -0.0025586 0.0461357 0.0633365 0.0723672 0.0081635 0.0676524 0.0488913 -0.0154523 0.0255597 -0.006894 0.1177357 0.1060255 0.0206524 -0.0383181 0.0541296 0.1994593 0.0732567 -0.083016 0.0893866 0.2467671 -0.0431236 -0.0673387 0.0253075 -0.1503289 -0.1071133 -0.0585125 -0.0055015 -0.0701796 0.0980556 0.124504 -0.0003486 -0.0023534 0.1285031 0.0757752 0.064562 -0.077127 0.0540431 0.0601371 -0.0665879 -0.0435749 0.0688829 0.0217011 0.09725 -0.0659764 0.1414044 -0.0417363 -0.1336568 0.1534628 0.0285976 -0.0028708 0.0249286 0.2718548 -0.0294392 -0.0146116 -0.0689667 0.3308594 0.2321538 0.0246223 -0.0419634 0.0101589 0.2408275 0.0029479 -0.0891121 -0.0279597 0.3210392 0.0955614 -0.0201981 -0.0660367 0.0613587 -0.0158817 -0.0740366 -0.032425 -0.0598848 -0.0470249 0.0875313 -0.0439613 0.0706077 0.0420489 -0.049476 0.0749419 0.0554386 0.0549858 -0.0027779 -0.1429897 0.0319509 -0.010127 0.0205092 0.0857697 -0.0047882 -0.0131458 -0.002938 0.1268456 unknown
polarizability: 211.4249634|1.5784886|128.5690589|-1.9696812|1.4773276|64.6943319 unknown
InChI: InChI=1S/C7H10N4OS/c1-9-6(12)4-3-10-7(13-2)11-5(4)8/h3,9H,8H2,1-2H3
charge 0 multiplicity 1
23 atoms
S  3.836704 0.588003 0.002001
O  -2.830046 1.430313 -0.598678
N  -2.854446 -0.686107 0.38778
N  1.46858 -0.767421 -0.295042
N  1.379489 1.654013 -0.020024
N  -0.436981 -2.074742 -0.588094
C  -0.699509 0.358107 -0.167066
C  0.097213 -0.824411 -0.341767
C  -2.195833 0.422017 -0.158156
C  0.021971 1.573134 -0.053154
C  2.033509 0.452692 -0.115275
C  -4.318361 -0.707773 0.527444
C  4.3378 -1.21376 -0.190607
H  -0.533081 2.514302 0.015441
H  -2.304813 -1.348182 0.94209
H  -4.719749 -1.703011 0.266934
H  -4.731497 0.047523 -0.159119
H  -4.637167 -0.448379 1.5551
H  0.222979 -2.82971 -0.771288
H  -1.415402 -2.177225 -0.853422
H  3.998475 -1.592679 -1.164637
H  3.896992 -1.812975 0.618156
H  5.437274 -1.21983 -0.128416
