program: Gaussian 09
title: 000295912
version: EM64L-G09RevD.01
frameworkgroup: C1[X(C7H4N4)]
method: RPBEPBE
basis: SDD
operation: Freq
keyword: #p
keyword: freq=noraman
keyword: PBEPBE/SDD
title: #p freq=noraman PBEPBE/SDD
converged: NO YES NO YES
title: Mulliken charges:
elementType: N N N N C C C C C C C H H H H
charge: -0.039175 -0.613536 -0.013295 -0.013637 0.263443 0.080157 -0.376227 0.389534 -0.430856 -0.265470 -0.248901 0.287799 0.276102 0.356738 0.347325
chargesum: 0.00000
title: Mulliken charges with hydrogens summed into heavy atoms:
elementType: N N N N C C C C C C C
charge: -0.039175 0.090526 -0.013295 -0.013637 0.263443 0.080157 -0.088428 0.389534 -0.154754 -0.265470 -0.248901
polarizability: 1.72407678e+02 6.59145396e-01 1.02829463e+02 2.39419937e-03 -9.90053901e-04 3.90567899e+01
1716.lowfreq: -6.2922 -0.0007 -0.0006 -0.0003 1.1659 8.5140 95.5902 111.4649 126.3903
frequency: 95.5881 111.4649 126.3900 161.4612 250.4511 364.7451 391.4812 418.6609 467.3220 468.4884 502.8384 515.8684 524.3138 591.4361 595.1558 627.9905 667.1876 779.6624 784.8520 937.8102 944.2394 948.8660 1003.5154 1130.9822 1219.8733 1294.4712 1321.3386 1362.5820 1399.6632 1481.9729 1521.2649 1596.8769 1629.0377 2164.2226 2177.8092 3149.5959 3175.7119 3530.7355 3680.7617
redmass: 5.5229 12.1669 6.5936 6.9909 9.4904 3.8138 4.8404 8.8305 3.4646 8.3073 1.9841 9.2887 1.6718 1.3314 5.7916 4.9032 10.9124 6.9469 5.3704 1.5725 5.4335 1.3860 2.0663 2.5644 2.8901 1.6231 3.8965 2.8040 5.1667 3.4309 4.7529 3.3546 1.6644 12.6159 12.6203 1.0933 1.0949 1.0451 1.1053
irintensity: 0.2533 7.4303 7.5587 1.4111 4.3815 10.4762 1.7872 0.3489 11.4538 0.8378 14.5389 1.5539 137.3525 140.4143 4.9212 8.5651 0.4991 15.4329 4.6695 31.3661 1.0023 0.0314 1.3909 3.8863 10.9751 25.9850 11.7773 10.1508 22.8359 71.8748 112.6509 34.7683 462.1432 56.3543 56.3861 4.5825 0.0492 153.9807 52.1462
temp: 298.150 k
press: 1.00000 atm
elementType: 7 7 7 7 6 6 6 6 6 6 6 1 1 1 1
symmnumber: 1
zpe: 263876.4 jmol-1
zpe.correction: 0.100505 hartree
zpe.thermalcorrener: 0.109715 hartree
zpe.thermalcorrenthalpy: 0.110659 hartree
zpe.thermalcorrgfe: 0.065882 hartree
zpe.sumelectzpe: -487.386919 hartree
zpe.sumelectthermal: -487.377710 hartree
zpe.sumelectthermalent: -487.376766 hartree
zpe.sumelectthermalfe: -487.421543 hartree
dipole: 3.1406 2.9541 -0.0002
dipole: 4.3116
quadrupole: -79.2865 -64.2138 -63.9897
quadrupole: 7.3905 0.0007 0.0022
quadrupole: -10.1231 4.9495 5.1737 7.3905 0.0007 0.0022
hfenergy: -487.4874244 hartree
pointgroup: C01 [X(C7H4N4)]
dipole: 1.2015628 1.1969041 0.0342988 debye
dipolederiv: -0.9559604 -0.4947196 -0.0181945 0.1771699 -0.2730561 0.0035196 -0.0125642 -0.0101239 -0.2643125 -1.2905476 -0.7254094 -0.0187731 -0.5525137 -0.4523446 -0.0094114 -0.0172625 -0.0128647 -0.6638253 -0.3951184 0.1901087 -0.0014656 0.0818529 -0.3118492 0.0008668 -0.0025467 0.0032176 -0.2348469 -0.5446753 -0.1032018 -0.0070206 -0.0995038 -0.2423344 -0.0020256 -0.0069618 -0.0020919 -0.2412033 -0.5129251 0.22499 -0.0100446 -0.4768939 -0.286417 -0.012708 -0.0159334 0.0013976 0.0767698 1.4266491 0.814336 0.0315632 0.5630268 0.5452855 0.0142495 0.0295245 0.0193799 0.2096363 0.7177785 -0.1937805 0.014235 -0.039424 0.1300408 0.0009064 0.0155619 -0.0022361 -0.0689056 -0.4600427 -0.0419977 -0.0115068 0.1373889 -0.4293056 -0.0016529 -0.0099669 -0.0052365 0.091848 0.4378697 0.3326907 0.0120235 0.0647985 0.6572048 0.0070323 0.0097578 0.0124506 -0.0179796 0.3289656 -0.4262292 0.0024744 -0.2276599 0.1571005 -0.0033364 0.0041973 -0.0074472 0.0217597 0.6200344 0.2495404 0.0140205 0.2196942 -0.0045062 0.0041396 0.0137405 0.0047358 0.0309681 0.1144016 -0.009481 -0.0010128 -0.0118276 0.0146321 -0.0014817 -0.0010367 -0.0014382 0.1608305 -0.003476 0.062505 -0.0022001 0.0650822 0.0660312 0.0007559 -0.0021624 0.0006915 0.1318954 0.2995861 0.0706474 -0.0011771 -0.0062068 0.152101 -0.0020927 -0.0018919 -0.000554 0.3858435 0.2174605 0.050001 -0.0029214 0.1050161 0.277417 0.0012385 -0.0024554 0.0001196 0.3815218 unknown
polarizability: 172.2582437|2.6280874|102.9189569|2.7168579|0.5909778|39.11673 unknown
InChI: InChI=1S/C7H4N4/c8-2-5-1-6(3-9)7(10)11-4-5/h1,4H,10H2
charge 0 multiplicity 1
15 atoms
N  0.063922 1.894125 0.041474
N  2.376955 1.607127 0.085875
N  3.107884 -1.912153 0.071203
N  -3.947097 -0.878601 -0.062849
C  0.956403 -0.402664 0.039959
C  1.135096 1.03292 0.05583
C  -0.356755 -0.917398 0.009109
C  -1.460189 -0.025493 -0.00553
C  -1.182325 1.376018 0.011958
C  2.107049 -1.253807 0.055966
C  -2.812216 -0.499008 -0.036799
H  -0.516853 -1.998956 -0.003323
H  -2.005728 2.098044 0.001484
H  3.227871 1.047514 0.098538
H  2.431584 2.62453 0.095608
