program: Gaussian 09
title: 000295904
version: EM64L-G09RevD.01
frameworkgroup: C1[X(C10H18O3)]
method: RPBEPBE
basis: SDD
operation: Freq
keyword: #pfreq=noraman
keyword: PBEPBE/SDD
title: #p freq=noraman PBEPBE/SDD
converged: YES YES NO NO
title: Mulliken charges:
elementType: O O O C C C C C C C C C C H H H H H H H H H H H H H H H H H H
charge: -0.428965 -0.269137 -0.240528 -0.060226 -0.393200 -0.347247 -0.360994 0.215246 -0.000107 -0.699053 -0.607935 -0.262344 -0.666722 0.201903 0.226959 0.224009 0.241730 0.233337 0.180584 0.252489 0.214144 0.208592 0.215179 0.334887 0.237044 0.224425 0.218562 0.213381 0.219980 0.225439 0.248567
chargesum: 0.00000
title: Mulliken charges with hydrogens summed into heavy atoms:
elementType: O O O C C C C C C C C C C
charge: -0.094078 -0.269137 -0.240528 0.141677 0.057769 -0.105516 0.052927 0.215246 0.252382 -0.061138 -0.175992 0.199125 0.027263
polarizability: 1.22836246e+02 -1.01343072e+01 1.31252745e+02 3.56014624e+00 1.90678883e+00 1.03653041e+02
1716.lowfreq: -6.4977 -0.0007 -0.0006 -0.0003 3.8419 13.5023 24.6250 42.3232 49.5854
frequency: 21.5653 42.2252 49.5707 71.9381 78.6450 92.8897 97.8229 126.6736 169.0839 181.5864 225.7138 243.8021 246.4166 296.1385 310.2111 316.8405 317.6385 366.7449 388.7754 447.5349 466.0279 533.9156 646.3509 702.1585 737.6151 744.5315 800.7317 812.9886 835.6327 860.8470 901.1120 921.0178 941.2688 960.8243 973.9988 1014.2601 1016.7202 1039.5344 1066.9941 1087.1439 1093.9037 1104.4085 1118.0269 1153.2599 1157.4631 1207.2540 1229.1679 1260.4102 1277.2929 1281.3020 1289.5583 1296.2527 1305.0352 1336.4267 1354.4132 1354.9513 1390.1800 1390.5740 1402.4262 1432.1144 1456.0296 1458.4330 1464.5690 1475.4347 1479.3599 1483.2386 1487.2515 1633.3591 1663.0312 2934.7517 2968.1076 2972.1441 2990.0815 2992.8375 3013.8237 3029.5291 3031.2560 3054.2977 3071.6199 3072.7883 3088.0742 3089.3160 3092.7661 3119.3923 3121.4870 3197.3761 3555.0611
redmass: 3.9405 3.4918 2.7828 2.6367 3.6802 2.8282 2.7149 2.7261 2.4150 4.0845 1.3007 1.1417 2.1325 2.8583 2.5674 2.2525 1.7356 3.8052 2.9425 3.1384 2.7922 2.2798 3.9682 3.8948 2.7888 1.2371 1.9445 1.7692 1.7270 2.1974 1.7980 2.7585 1.3380 2.1409 2.1942 1.1809 2.8317 2.7561 2.2509 2.0190 2.1093 2.6461 1.7782 1.9757 2.0438 1.3741 1.2760 1.2395 1.1179 1.3242 1.2281 1.1936 1.2811 1.2832 1.3292 1.4132 1.2363 1.2323 1.5756 1.2201 1.0949 1.0785 1.0432 1.0586 1.0423 1.0509 1.0776 9.1174 4.7937 1.0841 1.0618 1.0384 1.0604 1.0359 1.0845 1.0947 1.0595 1.1020 1.0991 1.1014 1.0975 1.0609 1.1029 1.1065 1.0936 1.1141 1.0660
irintensity: 0.9019 0.4113 0.4711 0.0241 0.2927 0.3489 0.4668 0.3502 3.7517 4.6529 3.6451 1.3284 0.9403 19.7202 7.0025 37.4020 101.6256 4.7330 1.7805 3.7194 14.5293 3.8557 8.9656 12.3480 14.2962 3.9834 5.1197 2.7578 14.8644 20.0967 8.3196 6.9522 56.5659 67.9705 33.6072 10.8623 83.2668 22.1468 35.2621 94.9128 53.9463 127.2258 5.4663 11.6213 49.7083 51.4273 12.8783 35.0887 1.5890 29.0532 17.1574 9.6716 22.0968 8.2474 2.3381 7.4334 15.9111 20.1525 4.6659 6.1602 14.6367 2.6282 16.3805 3.3047 12.5079 14.3723 13.1068 141.3545 12.8670 45.2891 39.3872 30.3446 20.8504 18.0080 15.0163 2.6064 31.4190 2.9776 52.8443 85.0182 37.0994 8.9371 1.8117 30.4268 5.6159 23.1148 7.1181
temp: 298.150 k
press: 1.00000 atm
elementType: 8 8 8 6 6 6 6 6 6 6 6 6 6 1 1 1 1 1 1 1 1 1 1 1 1 1 1 1 1 1 1
symmnumber: 1
zpe: 691353.8 jmol-1
zpe.correction: 0.263323 hartree
zpe.thermalcorrener: 0.279629 hartree
zpe.thermalcorrenthalpy: 0.280573 hartree
zpe.thermalcorrgfe: 0.217957 hartree
zpe.sumelectzpe: -616.452684 hartree
zpe.sumelectthermal: -616.436378 hartree
zpe.sumelectthermalent: -616.435433 hartree
zpe.sumelectthermalfe: -616.498050 hartree
dipole: 2.0990 -0.6530 1.9500
dipole: 2.9385
quadrupole: -77.7139 -76.2202 -80.5675
quadrupole: -3.2563 4.6385 0.9767
quadrupole: 0.4533 1.9470 -2.4003 -3.2563 4.6385 0.9767
hfenergy: -616.7160064 hartree
pointgroup: C01 [X(C10H18O3)]
dipole: -0.7967296 -0.2911885 -0.785488 debye
polarizability: 122.1212512|10.0375677|131.679477|3.9606745|-2.0310005|103.9413035 unknown
InChI: InChI=1S/C10H18O3/c1-4-7-9(11)8(5-2)10(12)13-6-3/h5,8-9,11H,2,4,6-7H2,1,3H3
charge 0 multiplicity 1
31 atoms
O  1.845664 0.781223 -1.680666
O  -2.308993 -0.000284 -0.681767
O  -1.455991 -0.089508 1.490567
C  0.883025 0.084803 -0.815773
C  1.705098 -0.576972 0.298774
C  -0.214621 1.106145 -0.298303
C  2.56458 -1.754058 -0.213771
C  -1.362471 0.299979 0.303473
C  0.325008 2.109825 0.698426
C  3.428901 -2.378267 0.902219
C  0.623391 3.395399 0.395507
C  -3.459023 -0.864825 -0.263298
C  -3.089823 -2.346779 -0.371965
H  0.343727 -0.691554 -1.405524
H  1.023598 -0.925123 1.09921
H  2.363724 0.194535 0.741686
H  -0.6084 1.625728 -1.192764
H  3.210133 -1.391973 -1.035603
H  1.901885 -2.532087 -0.647112
H  0.468327 1.734693 1.720787
H  4.121645 -1.629386 1.330414
H  2.800242 -2.763016 1.727839
H  4.036209 -3.218863 0.519167
H  1.372659 1.143887 -2.472428
H  -3.739613 -0.594634 0.769762
H  -4.261648 -0.583389 -0.963318
H  1.028742 4.079898 1.148707
H  0.479352 3.803097 -0.612963
H  -3.972486 -2.968926 -0.133862
H  -2.757872 -2.598163 -1.394228
H  -2.287968 -2.603702 0.340507
