program: Gaussian 09
title: 000295903
version: EM64L-G09RevD.01
frameworkgroup: C1[X(C11H10N2O)]
method: RPBEPBE
basis: SDD
operation: Freq
keyword: #p
keyword: freq=noraman
keyword: PBEPBE/SDD
title: #p freq=noraman PBEPBE/SDD
converged: YES YES NO NO
title: Mulliken charges:
elementType: O N N C C C C C C C C C C C H H H H H H H H H H
charge: -0.257214 -0.158025 0.000648 -0.587800 0.512780 -0.430088 -0.364993 -0.065682 0.088161 -0.222438 -0.224459 -0.219414 -0.235102 -0.289841 0.277090 0.230750 0.226917 0.280368 0.259087 0.227974 0.231882 0.241672 0.232035 0.245691
chargesum: 0.00000
title: Mulliken charges with hydrogens summed into heavy atoms:
elementType: O N N C C C C C C C C C C C
charge: -0.257214 -0.158025 0.000648 -0.079959 0.512780 -0.203170 -0.084625 0.193405 0.088161 0.005536 0.007423 0.022258 -0.003067 -0.044150
polarizability: 1.59383931e+02 3.91533833e+00 1.32409695e+02 -3.48136733e+00 -4.99363009e+00 9.03145434e+01
1716.lowfreq: -11.2150 -3.1827 -0.0009 -0.0001 0.0004 13.0095 25.2180 47.2569 59.4025
frequency: 24.6670 47.1463 59.3168 102.1630 197.5386 234.1564 272.0367 386.8815 404.2374 412.2128 452.5535 505.4466 512.0294 545.9706 579.2184 611.1120 617.6797 702.4358 711.8465 760.1958 764.5010 770.9919 820.5778 860.3716 868.9671 926.5223 939.5190 950.3728 954.3189 964.4326 984.1689 989.3500 1004.5441 1026.7803 1053.1484 1076.5701 1095.8888 1152.7326 1174.2329 1189.2372 1211.7700 1216.2507 1316.5522 1337.8077 1351.8775 1380.3300 1387.2992 1426.2173 1444.1458 1460.4532 1484.1413 1501.9426 1586.2102 1594.8958 1614.1528 1630.2123 3021.3741 3087.2940 3111.4704 3116.9454 3128.8757 3138.9643 3149.6277 3150.1805 3165.9047 3200.6844
redmass: 4.8057 4.8153 5.1305 6.0715 4.8935 5.4232 5.3870 2.0239 2.8366 4.3829 3.7123 3.7634 3.7754 6.0111 7.3648 5.0077 6.2453 4.2200 1.8279 4.2949 1.8327 1.8350 3.4707 1.2655 4.0698 1.5695 1.3769 2.3914 1.4982 3.7217 1.3776 6.1722 1.3259 2.2523 2.6047 2.1700 1.6402 2.0416 1.0553 1.1147 1.8959 1.5460 1.5339 1.3487 1.2573 2.0002 3.6940 2.1084 2.1678 1.1935 2.2397 5.7389 5.9121 6.0833 6.0451 8.3647 1.0599 1.1037 1.0883 1.0915 1.0864 1.0916 1.0923 1.0961 1.1015 1.0986
irintensity: 4.9423 3.3496 2.3639 0.7835 1.8055 2.6503 0.8598 3.4700 0.1300 2.0321 1.7287 8.4728 3.2361 7.0551 2.4094 10.7384 0.3388 1.2253 84.9148 30.5068 42.2542 31.6206 5.6430 0.6832 16.5856 0.3551 0.1528 6.7255 1.3085 6.6494 0.2266 0.1717 0.8361 6.6130 2.7693 30.5282 5.2304 18.5570 0.2049 2.5766 16.5622 4.3228 36.9183 17.5177 3.4616 36.8521 21.8239 16.6424 17.0154 25.7103 16.2204 94.2155 114.2936 4.0253 3.7029 392.5287 28.9762 4.4546 12.0102 30.6596 0.7221 11.6954 0.7017 24.7031 24.7263 4.9349
temp: 298.150 k
press: 1.00000 atm
elementType: 8 7 7 6 6 6 6 6 6 6 6 6 6 6 1 1 1 1 1 1 1 1 1 1
symmnumber: 1
zpe: 490000.3 jmol-1
zpe.correction: 0.186631 hartree
zpe.thermalcorrener: 0.197874 hartree
zpe.thermalcorrenthalpy: 0.198818 hartree
zpe.thermalcorrgfe: 0.147489 hartree
zpe.sumelectzpe: -608.906219 hartree
zpe.sumelectthermal: -608.894976 hartree
zpe.sumelectthermalent: -608.894032 hartree
zpe.sumelectthermalfe: -608.945361 hartree
dipole: -2.3548 -5.9352 -0.0229
dipole: 6.3853
quadrupole: -80.0122 -82.9469 -78.9273
quadrupole: -11.9811 0.1950 -3.4730
quadrupole: 0.6166 -2.3181 1.7015 -11.9811 0.1950 -3.4730
hfenergy: -609.0928499 hartree
pointgroup: C01 [X(C11H10N2O1)]
dipole: 0.7897051 2.3830893 -0.0911922 debye
dipolederiv: -0.6027236 0.2849863 -0.1180731 0.1711811 -1.0642371 0.2653487 -0.1110608 0.3140964 -0.4765478 -0.6235574 -0.212155 -0.049922 0.5876439 -0.6899372 0.3613568 -0.3224582 -0.0849455 -0.2713019 -0.4904469 0.4735372 -0.1845928 -0.0351758 -0.6873229 0.0779851 -0.1208992 0.3273094 -0.3768522 0.5899631 -0.0027699 0.0208053 -0.1781937 0.1146018 0.0515358 0.2114794 0.0696736 0.3237378 0.1562106 0.02506 -0.0810804 -0.0194532 -0.0098622 -0.0013331 -0.1710358 -0.0122287 -0.1046961 -0.1715585 -0.0120156 -0.0611074 0.044619 -0.0047247 0.0898251 -0.021111 0.0989199 -0.06291 -0.1083517 0.0738361 -0.0001306 0.0750613 -0.0391479 0.0244398 0.0428754 0.0029481 -0.1182428 0.4938789 0.0606093 0.2414384 -0.5899169 0.205354 -0.2823354 0.4436145 -0.0068929 0.1974002 0.668724 -0.3576826 0.2411427 -0.1943383 1.4955919 -0.3767859 0.2473963 -0.3608434 0.4197662 -0.019652 0.1151832 -0.0282429 0.1148197 0.0452377 0.0247699 -0.0140586 0.0305647 -0.108487 -0.0768485 -0.0226711 -0.0578685 -0.0314138 0.0672746 0.11189 -0.0621443 0.1286618 -0.0424164 -0.659706 -0.2599166 -0.1502359 -0.1968166 -0.2849186 -0.0902632 -0.2530837 -0.1538979 -0.2702288 0.0129601 0.0267294 -0.1236214 0.013058 -0.0786439 0.0267066 -0.1092588 0.0242909 -0.0622108 0.4383741 0.0226608 0.2334129 0.3229025 0.7706315 0.0092687 0.1915156 -0.0999091 0.1540767 0.0407413 -0.0189551 0.0557558 0.0693008 0.0525881 0.0948335 0.0083836 -0.0046612 0.0858126 -0.0194605 -0.0028878 -0.0243077 0.0148441 -0.0320602 -0.1739758 -0.0256011 -0.0587008 0.0060338 0.0942081 0.0526903 0.0780399 0.0347966 -0.0171127 -0.1073794 0.0621783 -0.1148439 0.0382809 0.1208844 -0.0965402 0.0207731 -0.0808133 0.046166 -0.0234362 -0.00351 -0.0032632 0.119689 0.0886063 -0.1010288 -0.0496772 -0.0798121 0.0127446 -0.0054728 -0.0396282 -0.0175127 0.1114798 0.0086366 -0.1112069 0.0225564 -0.1307107 -0.0322316 -0.0279605 0.0323338 -0.0304397 0.1263809 0.0770269 0.018783 0.0528468 0.0374234 -0.0252105 -0.1099379 0.0677814 -0.1079079 0.0600329 0.1026709 0.0234081 -0.0552158 0.0364679 -0.0356207 0.06232 -0.0663934 0.0554373 0.1463313 -0.0548175 -0.0151989 0.1215883 -0.0186051 0.1031213 -0.0210573 0.1324768 -0.0205382 0.068326 -0.0657625 0.0355449 -0.1042841 0.033131 0.0877186 0.0196575 -0.1197919 0.0246829 0.0365456 unknown
polarizability: 158.9039824|5.5759241|133.227032|2.2533566|3.8020176|89.9771555 unknown
InChI: InChI=1S/C11H10N2O/c14-11-12-7-4-8-13(11)9-10-5-2-1-3-6-10/h1-8H,9H2
charge 0 multiplicity 1
24 atoms
O  -1.421222 -2.154502 0.764124
N  -1.183462 0.181823 0.642629
N  -3.084936 -0.945643 -0.39524
C  0.054077 0.090305 1.481274
C  1.333549 0.107196 0.654688
C  2.199575 1.2277 0.691484
C  1.670537 -1.00544 -0.160171
C  -1.595498 1.388485 0.133404
C  -1.896381 -1.06296 0.346909
C  3.38558 1.243634 -0.078722
C  2.851712 -0.986714 -0.932263
C  -2.745271 1.47302 -0.642357
C  3.711899 0.136969 -0.894638
C  -3.464215 0.253426 -0.86062
H  -0.040458 -0.859615 2.034032
H  0.038343 0.931849 2.196445
H  1.954653 2.085116 1.33184
H  1.006745 -1.877557 -0.176487
H  -0.97421 2.258628 0.368946
H  4.052079 2.112442 -0.039696
H  3.10585 -1.84935 -1.558018
H  -3.083895 2.426126 -1.050649
H  4.630319 0.147011 -1.492094
H  -4.396667 0.265953 -1.440021
