program: Gaussian 09
title: 000295891
version: EM64L-G09RevD.01
frameworkgroup: C1[X(C8H10N6O)]
method: RPBEPBE
basis: SDD
operation: Freq
keyword: #p
keyword: freq=noraman
keyword: PBEPBE/SDD
title: #p freq=noraman PBEPBE/SDD
converged: YES YES NO NO
title: Mulliken charges:
elementType: O N N N N N N C C C C C C C C H H H H H H H H H H
charge: -0.338937 -0.186294 -0.046482 -0.079198 -0.651154 -0.636045 -0.641314 0.090236 0.074758 0.076758 -0.326351 0.148430 0.037788 -0.622723 0.180245 0.204171 0.255057 0.238828 0.238936 0.312013 0.324236 0.382880 0.313677 0.312571 0.337912
chargesum: 0.00000
title: Mulliken charges with hydrogens summed into heavy atoms:
elementType: O N N N N N N C C C C C C C C
charge: -0.338937 -0.186294 -0.046482 -0.079198 -0.014904 0.060513 0.009169 0.090236 0.074758 0.076758 -0.122180 0.148430 0.037788 0.110098 0.180245
polarizability: 2.18851327e+02 8.02631853e+00 1.56666283e+02 8.60936378e-01 9.36143388e-01 5.95860342e+01
1716.lowfreq: -4.4129 -0.0009 -0.0008 -0.0006 2.6672 5.5080 39.2852 74.0232 112.3178
frequency: 39.2732 74.0224 112.3170 126.2247 157.3383 163.1480 165.1741 229.2201 237.9253 271.5950 301.0067 355.0998 375.0791 387.9078 391.2279 429.9529 448.4691 454.6913 491.8089 538.7322 559.3332 573.3032 623.0229 624.7650 643.4347 662.5021 681.6863 721.4223 755.9121 769.3197 802.2291 809.4413 895.3904 939.7528 994.5943 1037.4582 1064.1913 1087.0462 1117.6415 1127.8147 1190.5883 1221.3678 1291.3474 1342.5050 1356.3991 1396.5882 1409.7180 1429.2338 1441.3869 1464.7352 1467.7020 1486.6115 1532.9937 1570.2822 1577.7987 1586.9483 1623.7043 1626.5323 1629.7562 2991.0506 3074.9673 3117.9897 3120.5237 3336.6348 3538.9471 3573.9540 3636.9427 3692.0289 3723.0291
redmass: 3.6401 4.8497 1.3081 3.2644 2.6698 4.0995 1.2778 6.6644 3.0820 3.9731 4.1948 5.3911 3.8999 4.1912 1.7879 1.5024 3.0119 1.7096 5.6567 1.1628 4.0099 1.2884 7.0250 5.9339 5.0588 4.3722 6.9520 6.5630 8.7383 1.9562 1.8850 4.1422 1.5604 3.0436 3.6290 2.3150 1.8363 2.5288 2.3556 1.3002 2.6951 3.4619 2.1217 4.1479 4.2200 5.8672 2.5463 1.9517 2.2572 1.0453 2.9354 1.3248 5.3918 2.9243 2.2487 2.2193 2.2100 2.7811 1.6267 1.0336 1.1021 1.1002 1.0909 1.0594 1.0449 1.0453 1.0922 1.1036 1.1038
irintensity: 3.3793 3.7330 2.4395 1.1330 14.9273 1.3353 137.9211 1.5564 3.4167 15.5210 7.2124 7.4708 49.0315 4.9241 11.8784 171.9653 4.5942 119.0009 2.7211 4.6447 6.1274 262.9732 30.0394 28.6960 13.9412 5.5988 4.0943 0.7435 0.2011 14.6363 123.0954 16.8599 18.4192 10.4227 3.8906 9.9662 14.3228 8.3934 8.2650 0.8635 11.1089 6.7793 89.3748 1.6199 323.3308 100.6892 44.0369 10.9446 85.0149 15.8877 201.1155 112.1513 128.6554 13.0594 99.5132 353.0975 308.1875 377.0065 403.3283 77.9974 26.4564 5.0870 17.7800 219.9318 53.5519 80.3401 71.6382 29.2265 28.1802
temp: 298.150 k
press: 1.00000 atm
elementType: 8 7 7 7 7 7 7 6 6 6 6 6 6 6 6 1 1 1 1 1 1 1 1 1 1
symmnumber: 1
zpe: 500593.8 jmol-1
zpe.correction: 0.190666 hartree
zpe.thermalcorrener: 0.204746 hartree
zpe.thermalcorrenthalpy: 0.205690 hartree
zpe.thermalcorrgfe: 0.150171 hartree
zpe.sumelectzpe: -713.533494 hartree
zpe.sumelectthermal: -713.519414 hartree
zpe.sumelectthermalent: -713.518470 hartree
zpe.sumelectthermalfe: -713.573989 hartree
dipole: 0.3373 3.7843 0.3536
dipole: 3.8158
quadrupole: -92.5152 -61.4567 -91.5274
quadrupole: -7.1085 -2.8657 0.1469
quadrupole: -10.6821 20.3764 -9.6943 -7.1085 -2.8657 0.1469
hfenergy: -713.7241598 hartree
pointgroup: C01 [X(C8H10N6O1)]
dipole: 0.0812488 -1.4964093 0.088745 debye
dipolederiv: -1.1887693 0.254318 0.0682711 0.1845216 -0.8479983 -0.0321592 0.030847 -0.0423199 -0.3935416 -0.9439664 0.1643315 0.0265937 -0.3379903 -0.2802458 0.0546829 0.1399203 0.0189659 -0.1780462 -1.1454548 0.443956 0.0004752 0.1431776 -0.4687545 0.025004 0.0697452 -0.0193765 -0.264735 -0.4979567 -0.4672982 0.106525 -0.0116601 -0.2487803 -0.0045193 0.0097866 0.0502965 -0.2420419 -0.3116626 0.232715 -0.1231091 0.4825775 -1.4009958 0.0574572 -0.1382239 -0.0006075 -0.7050581 -0.9284192 0.5175484 -0.0851234 0.6821221 -0.9682207 -0.0143909 -0.1106201 0.0386491 -0.6470831 -0.6261517 -0.3670995 -0.0592671 -0.6799056 -1.0526455 0.082545 -0.0259871 0.0789018 -0.6790105 -1.1032498 0.2823403 0.0181208 -0.4718886 -0.4713014 0.1183518 0.1717743 0.0608353 -0.0161609 1.2595041 -0.1831455 -0.0687946 0.3476518 0.3529703 -0.0599168 -0.201426 -0.0272549 0.1211547 0.7193809 -0.3573223 0.0464386 -0.6851108 1.4963659 -0.2056772 0.1152984 -0.2210283 0.1519514 1.1446032 -0.1574624 -0.0461684 -0.2926006 0.1097074 -0.0350804 -0.0976269 -0.0512097 -0.0878015 -1.3131141 -0.1961931 0.1092496 0.4074627 -0.5135958 0.034755 0.0178095 0.0784374 -0.0426566 1.1917388 -0.5980754 -0.0015276 -0.5365115 1.0877381 -0.1039505 0.0257838 -0.0708034 0.1658275 0.3602241 0.2336884 -0.0541985 0.4154413 0.3031797 -0.0463044 -0.0897009 -0.0339107 0.2439317 2.0838341 0.2065588 -0.1277081 0.5301124 1.4269646 0.0177603 -0.1054229 0.0280192 0.2492365 0.0747036 -0.0665144 0.0144004 -0.0813967 -0.0963554 0.0508232 0.0258628 0.0446813 0.124005 0.0703909 0.1108551 -0.0167715 0.0188062 0.0018715 0.022723 0.0003397 0.014374 0.1248717 -0.0759772 -0.1136942 -0.07548 -0.0938487 0.0636901 0.0104311 -0.1382067 -0.0555172 -0.0351488 -0.0372788 -0.0711456 0.1105588 -0.0406801 0.0696482 -0.04729 0.1625638 0.0213289 -0.0790064 0.1081826 0.0156378 0.0439861 -0.034187 0.2559065 0.0378517 0.0492388 0.082706 0.3587057 0.1920791 -0.0358724 0.0275369 -0.0384942 0.2141807 0.047671 0.0068874 0.0652355 0.3695756 0.4190264 0.1062481 -0.0062718 0.055238 0.3796989 0.0052755 -0.0046639 -0.0294438 0.3645994 0.1625469 -0.0691535 0.0334081 -0.0833465 0.2290326 0.0277074 0.0328381 0.0181964 0.3605016 0.1732712 0.0865628 0.0407096 0.090567 0.1688723 -0.0261159 0.0365508 -0.0348588 0.3613669 0.2125148 0.0282159 0.0181461 0.0299425 0.1890666 -0.0176345 0.0166318 -0.0142966 0.3745631 unknown
polarizability: 217.5813139|-11.2888129|155.3247771|-9.3844336|-13.3387035|62.1975541 unknown
InChI: InChI=1S/C8H10N6O/c1-14-8-4(6(10)13-14)2-3(7(11)15)5(9)12-8/h2H,9-11H2,1H3
charge 0 multiplicity 1
25 atoms
O  -3.953919 0.614161 0.485303
N  2.41499 0.781367 -0.169285
N  0.158735 1.712434 -0.14198
N  3.045712 -0.482291 0.033649
N  2.277413 -2.693627 0.514932
N  -2.068655 2.390252 -0.040971
N  -3.462324 -1.629086 0.410434
C  0.741062 -0.682267 0.252229
C  1.050257 0.697987 -0.038555
C  2.027935 -1.350018 0.286321
C  -0.61516 -1.015401 0.406163
C  -1.602916 -0.007458 0.282104
C  -1.15647 1.371869 0.031937
C  3.226265 1.95474 -0.455908
C  -3.055235 -0.301939 0.399604
H  -0.903777 -2.046312 0.644424
H  2.546427 2.814499 -0.564945
H  3.936151 2.145977 0.368039
H  3.79708 1.812421 -1.390343
H  1.543522 -3.317073 0.831412
H  3.239095 -3.022623 0.506036
H  -3.056086 2.158214 0.146507
H  -1.722453 3.330227 -0.220894
H  -2.843067 -2.410632 0.215426
H  -4.461584 -1.802118 0.508459
