program: Gaussian 09
title: 000296006
version: EM64L-G09RevD.01
frameworkgroup: C1[X(C24H19N2O2P)]
method: RPBEPBE
basis: SDD
operation: Freq
keyword: #p
keyword: freq=noraman
keyword: PBEPBE/SDD
title: #p freq=noraman PBEPBE/SDD
converged: YES YES NO NO
title: Mulliken charges:
elementType: P O O N N C C C C C C C C C C C C C C C C C C C C C C C C H H H H H H H H H H H H H H H H H H H
charge: 0.834425 -0.218080 -0.233288 -0.544866 0.015556 -0.101938 -0.012994 -0.024872 -0.251242 -0.301685 -0.284165 -0.275107 -0.296028 -0.292056 0.263738 -0.239492 -0.216364 -0.228062 -0.220595 -0.236734 -0.246857 -0.225956 -0.224482 -0.226374 -0.385105 -0.387167 0.357049 -0.164200 -0.407573 0.237447 0.284805 0.265122 0.311597 0.252431 0.272818 0.234377 0.238235 0.236578 0.235071 0.235718 0.245462 0.234082 0.236544 0.237576 0.261694 0.246762 0.228771 0.279421
chargesum: 0.00000
title: Mulliken charges with hydrogens summed into heavy atoms:
elementType: P O O N N C C C C C C C C C C C C C C C C C C C C C C C C
charge: 0.834425 -0.218080 -0.233288 -0.544866 0.015556 -0.101938 -0.012994 -0.024872 -0.013796 -0.016881 -0.019042 0.036490 -0.043596 -0.019238 0.263738 -0.005115 0.021871 0.008517 0.014476 -0.001015 -0.001395 0.008126 0.012062 0.011202 -0.123410 -0.140405 0.357049 0.064571 -0.128151
polarizability: 3.75035221e+02 -1.65340003e+01 2.58207114e+02 -1.17313300e+00 -1.65026212e+01 3.20812281e+02
1716.lowfreq: -7.8004 -4.4585 -0.0002 0.0003 0.0007 2.4284 15.6347 22.5503 28.8617
frequency: 15.3892 22.4413 28.8242 33.2673 39.1301 53.9099 57.3045 62.5608 65.5790 76.1596 110.3522 136.6309 168.4442 176.6602 201.1596 209.3175 226.5247 230.1307 242.8475 269.4842 283.0100 297.8642 378.0960 395.0435 401.6890 402.4109 422.2845 425.8988 434.8659 448.3503 480.1092 508.0750 516.3543 521.5091 536.5505 578.7477 611.3303 612.3168 612.9143 642.1660 666.1210 668.3608 686.5971 696.1088 699.2545 702.0152 703.9522 705.8627 721.4804 754.8828 757.2858 765.0717 794.7270 811.0803 855.3888 861.2977 864.4105 867.3300 909.6885 932.4079 938.0289 942.3995 960.1667 978.4497 981.3853 983.8643 986.7365 987.7457 988.0597 989.9025 991.4031 1005.5279 1006.2150 1014.0107 1018.8566 1019.2103 1021.0626 1072.1515 1074.0403 1077.2809 1079.1931 1082.5516 1083.4409 1087.2705 1090.9562 1163.7080 1173.3443 1176.5234 1177.0758 1185.8742 1191.9958 1196.7046 1214.4302 1275.9866 1284.3731 1306.7939 1313.1766 1317.1642 1358.7459 1372.0190 1375.1384 1378.4785 1382.1219 1424.1359 1428.0116 1429.2066 1446.9182 1465.0473 1465.1628 1467.2746 1468.0897 1553.0790 1582.7854 1586.9549 1588.6602 1593.4490 1593.8099 1596.7616 1606.5740 3125.9633 3127.8817 3129.9320 3132.9904 3135.0298 3135.1480 3137.5875 3142.1109 3143.8562 3146.4236 3153.4735 3155.4515 3156.3654 3162.3501 3167.7577 3168.5171 3169.8657 3188.2959 3194.2488
redmass: 5.1273 5.5658 5.2785 6.3741 4.8955 4.6647 5.3751 7.8669 5.7678 4.1401 7.2193 5.1775 5.4752 4.7357 5.3041 5.3761 5.1619 5.3598 6.1226 5.1142 6.2125 5.3278 9.6185 2.7881 2.8489 2.8454 5.3993 3.3569 6.0031 5.3813 5.4933 5.7791 6.0939 5.0831 5.0971 7.0199 6.4694 6.4655 6.4699 7.6203 6.9290 2.0248 6.4033 4.5414 2.4070 2.2085 2.1757 5.5072 8.7660 1.5679 1.5962 1.6095 1.3648 10.4584 1.3262 1.3945 1.2424 1.5173 1.3991 1.3563 1.3479 1.3677 4.8647 5.0970 1.3411 1.5666 3.3411 3.2977 2.1988 4.2672 1.4303 1.3277 1.3286 1.3258 3.2822 3.2849 2.8570 1.6813 1.6662 2.2483 2.2215 1.8376 1.8419 1.7872 2.5562 1.1198 1.0625 1.0552 1.0551 1.1247 1.1286 1.1361 8.7421 1.8104 2.2602 1.3469 1.3349 1.3270 9.1237 5.1092 7.0170 8.2701 8.7785 2.1049 2.1278 2.1298 4.4266 2.2340 2.3806 2.0796 2.0480 6.2689 5.7788 6.0641 6.1813 5.7891 5.8277 5.8707 7.2529 1.0863 1.0854 1.0857 1.0874 1.0878 1.0883 1.0872 1.0919 1.0922 1.0921 1.0962 1.0963 1.0959 1.0950 1.1015 1.1015 1.1015 1.0897 1.0951
irintensity: 0.2263 0.9708 0.1785 0.6567 0.3331 0.1021 0.7513 0.1475 0.0767 0.2849 3.2218 2.1916 2.5615 1.6968 5.0613 0.8456 2.8426 0.1231 0.2366 1.9123 4.8898 3.7055 0.8965 0.0204 0.1251 0.3733 8.7425 0.5220 3.1477 8.1829 5.6644 41.3201 56.6628 95.2981 4.8874 26.8087 0.1813 0.4038 0.2738 11.1510 3.8270 13.5802 23.3176 1.6341 41.1906 51.7379 70.6255 12.2211 35.2496 26.0811 31.6516 29.7727 26.4316 45.2780 4.6493 13.2781 0.4595 20.5931 2.4257 0.2402 1.8609 0.4978 75.9250 31.1641 1.2232 0.8001 2.8352 2.2760 3.2349 1.0855 0.4714 0.0862 0.3036 0.7509 1.4007 1.2675 8.6297 9.2958 24.3479 42.6125 15.5089 11.2048 7.7865 9.9852 24.9599 5.1365 2.3789 0.7123 0.4061 14.2634 17.1784 5.3204 300.4690 193.1968 171.2048 7.4950 5.4881 4.4892 25.6824 197.2162 4.8491 0.5393 2.6684 17.9391 30.9593 11.7371 9.6014 87.4121 221.1739 34.0735 11.6604 15.1618 0.3744 2.9420 0.3310 0.4508 0.9127 5.0130 188.9853 3.6330 0.8445 0.3474 2.1931 0.2424 7.3426 16.9187 5.4990 6.4430 10.9496 19.9776 18.7363 12.2701 16.5846 44.5131 33.0080 19.7145 5.2500 4.3355
temp: 298.150 k
press: 1.00000 atm
elementType: 15 8 8 7 7 6 6 6 6 6 6 6 6 6 6 6 6 6 6 6 6 6 6 6 6 6 6 6 6 1 1 1 1 1 1 1 1 1 1 1 1 1 1 1 1 1 1 1
symmnumber: 1
zpe: 956006.2 jmol-1
zpe.correction: 0.364124 hartree
zpe.thermalcorrener: 0.389184 hartree
zpe.thermalcorrenthalpy: 0.390129 hartree
zpe.thermalcorrgfe: 0.305608 hartree
zpe.sumelectzpe: -1525.019759 hartree
zpe.sumelectthermal: -1524.994698 hartree
zpe.sumelectthermalent: -1524.993754 hartree
zpe.sumelectthermalfe: -1525.078275 hartree
dipole: -7.9403 0.0862 -0.6953
dipole: 7.9712
quadrupole: -191.6693 -158.1997 -158.9095
quadrupole: -6.0408 8.6982 -1.0560
quadrupole: -22.0765 11.3931 10.6833 -6.0408 8.6982 -1.0560
hfenergy: -1525.3838823 hartree
pointgroup: C01 [X(C24H19N2O2P1)]
dipole: 2.9899279 -0.8628795 -0.3884472 debye
polarizability: 356.3562232|-46.373787|272.8160077|-2.3093519|5.4038737|324.8823842 unknown
InChI: InChI=1S/C24H19N2O2P/c27-26(28)21-12-10-11-20(19-21)25-29(22-13-4-1-5-14-22,23-15-6-2-7-16-23)24-17-8-3-9-18-24/h1-19H
charge 0 multiplicity 1
48 atoms
P  0.901153 -0.092225 0.127947
O  -5.583366 1.722693 -0.064962
O  -3.844683 1.305547 -1.475647
N  0.103069 0.132297 1.613631
N  -4.352771 1.395067 -0.286566
C  2.592318 -0.668743 0.648939
C  1.127766 1.483551 -0.877073
C  0.237433 -1.391314 -1.056558
C  3.54773 -1.063659 -0.316933
C  0.870505 2.709048 -0.218962
C  0.518454 -2.753783 -0.7845
C  2.910493 -0.676508 2.02535
C  1.595135 1.470441 -2.212944
C  -0.628698 -1.044934 -2.123282
C  -1.252326 0.474462 1.706345
C  4.833802 -1.470592 0.102392
C  1.075886 3.926876 -0.904291
C  -0.049287 -3.763486 -1.591408
C  4.199006 -1.084317 2.437323
C  1.8028 2.69229 -2.891412
C  -1.194821 -2.059861 -2.925883
C  5.161292 -1.479352 1.478708
C  1.543246 3.920161 -2.238809
C  -0.905992 -3.418546 -2.66305
C  -2.132172 0.777214 0.621562
C  -1.807825 0.535926 3.030231
C  -3.478619 1.10526 0.875518
C  -3.155534 0.875671 3.250851
C  -4.026276 1.166125 2.175104
H  3.297985 -1.068793 -1.384229
H  0.517035 2.701814 0.818521
H  1.174031 -3.024286 0.050915
H  2.137157 -0.369804 2.737298
H  1.785754 0.523192 -2.730111
H  -0.8672 0.002512 -2.338516
H  5.575821 -1.779012 -0.641906
H  0.869428 4.876456 -0.399224
H  0.172304 -4.815299 -1.380787
H  4.450559 -1.093001 3.503418
H  2.16188 2.685165 -3.926276
H  -1.869191 -1.786314 -3.743993
H  6.160303 -1.793701 1.801006
H  1.700844 4.865795 -2.769059
H  -1.350138 -4.203781 -3.284566
H  -1.794057 0.767681 -0.416636
H  -1.143838 0.303947 3.869265
H  -3.538096 0.909022 4.276949
H  -5.077297 1.424398 2.319107
