program: Gaussian 09
title: 000295920
version: EM64L-G09RevD.01
frameworkgroup: C1[X(C15H16BrN3O3)]
method: RPBEPBE
basis: SDD
operation: Freq
keyword: #p
keyword: freq=noraman
keyword: PBEPBE/SDD
title: #p freq=noraman PBEPBE/SDD
converged: YES YES NO NO
title: Mulliken charges:
elementType: Br O O O N N N C C C C C C C C C C C C C C C H H H H H H H H H H H H H H H H
charge: 0.021391 -0.196972 -0.280783 -0.303665 -0.449220 -0.163500 -0.000121 0.206492 0.006307 0.568939 -0.363157 -0.489243 -0.308729 0.017351 0.251020 -0.181392 -0.234522 -0.254719 -0.227777 -0.221810 -0.682962 -0.671763 0.368597 0.284043 0.324403 0.248267 0.227442 0.236286 0.223393 0.223440 0.232689 0.232743 0.207941 0.235169 0.235091 0.214988 0.232161 0.232185
chargesum: 0.00000
title: Mulliken charges with hydrogens summed into heavy atoms:
elementType: Br O O O N N N C C C C C C C C C C C C C C C
charge: 0.021391 -0.196972 -0.280783 -0.303665 -0.080623 -0.163500 -0.000121 0.206492 0.006307 0.568939 -0.079114 -0.489243 0.015674 0.017351 0.251020 0.066874 -0.007080 -0.018433 0.219056 0.243621 -0.004761 0.007571
polarizability: 3.23240466e+02 1.93462003e+00 2.86713308e+02 -1.82604529e-03 -1.43277814e-02 9.71235400e+01
1716.lowfreq: -4.8459 -0.0005 -0.0004 0.0004 1.2119 3.8098 13.0410 30.8015 43.8774
frequency: 12.8493 30.7583 43.8613 59.8601 61.5671 78.5317 80.3903 101.4497 110.6723 112.2322 141.1885 146.5250 169.7553 195.3001 213.3472 240.1814 247.6829 261.2016 281.2849 284.7551 313.5118 314.3654 357.0114 369.0411 425.7450 446.7430 448.7973 453.3773 534.1793 541.7751 584.6737 642.9523 647.8494 668.9798 678.2600 721.4705 727.3542 735.7071 761.4372 785.5481 794.0973 799.9059 810.9772 833.4743 841.2874 877.5129 891.2935 918.1149 954.8892 956.1372 979.5803 999.7249 1001.3720 1018.5023 1026.3542 1042.4801 1064.5316 1113.0608 1113.7642 1123.6302 1135.9570 1136.5067 1169.6095 1182.5291 1237.0246 1249.5619 1251.6183 1260.2134 1284.9085 1300.2967 1313.0438 1334.7479 1360.9223 1367.1977 1396.7463 1403.2218 1408.3620 1417.9823 1427.4630 1432.4118 1460.9834 1464.1684 1472.9038 1473.6273 1474.7161 1486.2904 1488.3722 1535.0614 1559.0425 1573.9387 1599.9742 1626.3349 2995.3838 2998.0883 2999.5565 3014.7025 3058.6865 3074.0459 3094.6003 3095.2275 3110.2823 3110.6904 3137.0250 3156.0310 3169.7582 3172.1984 3175.3616 3196.3151
redmass: 6.9470 4.0059 4.2503 6.0112 2.8801 3.8256 2.3210 6.0313 2.3681 8.6348 3.5899 3.5946 5.3117 5.5659 6.5942 1.2844 1.3040 4.7167 5.3796 5.6097 6.0691 6.3959 6.8630 4.1724 5.9495 3.5098 6.1332 3.6302 6.5387 3.6399 7.6343 6.9997 7.7973 10.9891 7.0233 8.3386 4.0908 6.1741 1.2511 7.4500 6.7615 1.1106 1.0961 4.6503 4.6343 1.3525 4.0935 1.1587 1.4420 1.3572 6.2901 1.3119 7.1785 2.4040 2.6777 2.0535 6.5546 2.2314 2.1498 1.7356 1.4589 1.4437 1.0749 4.4358 1.8484 1.1337 1.1401 4.6322 1.8974 2.1155 4.4639 1.6693 3.9450 1.7212 1.4607 1.3065 2.2374 3.6336 2.9117 2.8646 1.0398 1.0396 2.2675 1.1034 1.2316 1.0748 1.0875 6.2096 5.5565 7.6832 5.9799 2.2692 1.0483 1.0360 1.0447 1.0583 1.1074 1.1067 1.0984 1.0986 1.1020 1.1029 1.0869 1.0917 1.0930 1.0815 1.0981 1.0939
irintensity: 0.2182 2.0014 0.0914 0.2874 0.0394 1.4001 1.0727 0.0498 0.0067 0.3314 3.4175 4.2850 1.8460 7.1357 1.6783 0.6290 2.6429 1.9577 6.1880 4.3387 1.5065 0.6014 7.2828 27.0815 1.7995 7.4550 4.0268 1.0449 19.5165 0.9079 7.9591 15.5373 7.0384 5.8277 12.8970 0.0847 0.5064 1.3445 80.3602 14.3334 4.2508 2.6851 3.6487 14.3779 0.8083 2.3313 34.3197 85.5680 11.1985 3.9942 13.4918 2.3453 55.0187 8.8675 222.1531 10.7522 213.2795 4.6041 5.8768 29.8236 5.8444 4.8685 10.7607 389.4812 16.9006 0.0164 0.0199 466.9293 65.9808 103.3938 68.4877 177.4788 11.5204 44.6710 205.7263 54.7523 153.7029 194.3758 119.9392 17.2988 12.0843 12.7418 6.9768 15.6945 0.3088 5.0627 9.2799 235.3670 399.1297 759.7850 22.2601 249.4615 26.7269 23.3551 18.9729 16.1675 13.7338 6.3282 26.9371 23.4277 31.2779 45.7191 6.7144 13.1210 0.5464 197.5092 9.8552 22.6996
temp: 298.150 k
press: 1.00000 atm
elementType: 35 8 8 8 7 7 7 6 6 6 6 6 6 6 6 6 6 6 6 6 6 6 1 1 1 1 1 1 1 1 1 1 1 1 1 1 1 1
symmnumber: 1
zpe: 759847.3 jmol-1
zpe.correction: 0.289411 hartree
zpe.thermalcorrener: 0.310954 hartree
zpe.thermalcorrenthalpy: 0.311898 hartree
zpe.thermalcorrgfe: 0.235749 hartree
zpe.sumelectzpe: -982.996894 hartree
zpe.sumelectthermal: -982.975351 hartree
zpe.sumelectthermalent: -982.974407 hartree
zpe.sumelectthermalfe: -983.050555 hartree
dipole: -0.6246 -0.9475 0.0066
dipole: 1.1348
quadrupole: -98.4902 -151.3694 -140.3959
quadrupole: -0.5320 -0.0013 0.0984
quadrupole: 31.5950 -21.2842 -10.3107 -0.5320 -0.0013 0.0984
hfenergy: -983.2863044 hartree
pointgroup: C01 [X(C15H16Br1N3O3)]
dipole: 0.3488911 0.2777251 0.0219318 debye
polarizability: 320.5222411|-9.3821677|289.023139|8.562902|3.5588607|97.5319339 unknown
InChI: InChI=1S/C15H16BrN3O3/c1-3-21-14(20)10-9-17-15(22-4-2)19-13(10)18-12-8-6-5-7-11(12)16/h5-9,18H,3-4H2,1-2H3
charge 0 multiplicity 1
38 atoms
Br 0.763039 4.128758 0.116679
O  0.531784 -3.726422 -0.054182
O  -3.91481 0.616154 -0.137228
O  -2.116023 2.090813 -0.032195
N  0.363347 1.004673 0.041855
N  0.474668 -1.381194 -0.004979
N  -1.549315 -2.752884 -0.121764
C  -0.261522 -0.223236 -0.009992
C  -1.709705 -0.301227 -0.070858
C  1.739082 1.332518 0.101292
C  -2.271286 -1.604043 -0.124804
C  2.124375 2.708402 0.141558
C  2.787235 0.3657 0.122398
C  -0.191755 -2.560476 -0.060016
C  -2.556752 0.898446 -0.076408
C  3.472982 3.103721 0.198978
C  4.13759 0.760574 0.180097
C  4.49301 2.126394 0.218651
C  2.019178 -3.623682 0.012606
C  -4.834114 1.79889 -0.146938
C  2.543702 -5.055258 0.002882
C  -6.253304 1.24694 -0.21709
H  -0.314266 1.798069 0.031709
H  -3.358145 -1.713204 -0.172185
H  2.499857 -0.685038 0.090939
H  3.722316 4.168223 0.228159
H  4.916964 -0.009131 0.19461
H  5.541853 2.43609 0.263076
H  2.371132 -3.038198 -0.857104
H  2.292745 -3.079467 0.935726
H  -4.648824 2.386145 0.770256
H  -4.576584 2.427928 -1.017827
H  3.647869 -5.048512 0.053012
H  2.15789 -5.620729 0.867795
H  2.23866 -5.579285 -0.918539
H  -6.976078 2.082951 -0.225658
H  -6.401375 0.651201 -1.13379
H  -6.47282 0.607796 0.654975
