program: Gaussian 09
title: 000295882
version: EM64L-G09RevD.01
frameworkgroup: C1[X(C9H12N4OS)]
method: RPBEPBE
basis: SDD
operation: Freq
keyword: #p
keyword: freq=noraman
keyword: PBEPBE/SDD
title: #p freq=noraman PBEPBE/SDD
converged: YES YES NO NO
title: Mulliken charges:
elementType: S O N N N N C C C C C C C C C H H H H H H H H H H H H
charge: 0.277454 -0.284282 -0.010625 0.041131 0.039450 -0.621264 0.090878 0.001989 0.233043 -0.388777 -0.414695 -0.762700 -0.758723 0.159255 -0.826189 0.262410 0.231908 0.240914 0.256351 0.251253 0.291786 0.225321 0.328867 0.336510 0.240913 0.275129 0.282693
chargesum: 0.00000
title: Mulliken charges with hydrogens summed into heavy atoms:
elementType: S O N N N N C C C C C C C C C
charge: 0.277454 -0.284282 -0.010625 0.041131 0.039450 0.044113 0.090878 0.001989 0.233043 -0.126367 -0.414695 -0.033528 0.009637 0.159255 -0.027454
polarizability: 2.19034394e+02 -1.93288176e+00 1.72489724e+02 7.22960741e-01 1.46145999e-01 8.63025905e+01
1716.lowfreq: -7.4301 -5.0667 -0.0014 -0.0004 0.0014 3.4324 44.0804 58.3933 67.1629
frequency: 44.0318 58.3726 67.1618 82.1230 92.0426 106.7152 113.5890 117.6905 133.8107 153.6206 196.1829 211.3631 224.2477 283.9627 322.3065 349.6874 396.2231 419.9732 425.8234 468.7317 511.9182 517.4824 549.0394 570.2186 589.1510 654.9387 667.0963 673.8318 711.4322 726.8859 788.0287 804.4897 890.7543 936.2055 940.8959 954.9235 979.5762 993.9068 1027.9609 1055.0371 1086.0670 1094.9416 1177.7725 1222.4801 1254.6046 1268.7683 1311.7050 1347.3362 1356.3945 1372.6798 1385.4829 1389.9232 1434.1559 1444.9534 1449.5390 1451.5901 1457.2772 1467.8837 1474.5940 1519.4736 1576.8703 1624.0463 1727.6944 2982.1840 2985.7429 3024.0033 3063.0771 3078.4994 3109.1952 3123.3222 3126.9115 3147.9582 3156.2137 3519.8378 3674.7086
redmass: 4.2149 3.8278 4.6376 3.4396 2.8620 3.4885 1.2454 1.0712 3.1946 1.2103 4.2662 5.9028 6.9251 7.3199 3.3574 5.1617 4.1079 3.2793 3.6965 2.9735 1.2105 5.4338 3.4767 3.4501 1.5744 6.3713 7.6928 6.3827 7.1655 7.6575 5.9489 7.4675 3.2865 1.3648 1.4476 1.4555 1.1809 1.2896 4.6517 1.8085 2.2157 1.7950 4.5324 6.8235 4.2921 4.8244 2.7876 1.3085 2.5844 1.2611 1.5940 2.1522 1.0526 1.7526 1.0718 1.0874 1.0963 1.5112 1.2423 5.4889 2.4924 1.7913 10.0812 1.0372 1.0376 1.0284 1.0963 1.0951 1.1019 1.0921 1.0996 1.1040 1.1054 1.0448 1.1044
irintensity: 0.6506 2.4602 10.7707 4.8739 1.8609 2.1165 0.4096 0.5119 6.7583 0.4242 1.5698 3.6330 7.3599 1.5385 2.7005 2.2245 2.8595 8.3609 10.4508 7.5801 118.5964 19.4453 15.4137 6.8890 134.8447 7.1249 3.5453 2.6952 34.0018 10.6842 13.7863 54.6092 33.1216 6.4583 9.0006 1.0243 7.8887 4.6379 22.2450 19.5789 21.1467 3.6710 229.1570 29.1384 104.5167 6.1811 136.1116 67.0491 158.5993 59.3073 163.2224 33.7641 16.5202 129.9862 16.8581 6.5066 0.5807 99.6401 90.8938 414.1410 163.6910 286.4574 407.9530 3.2857 17.5442 22.3133 9.7828 4.9137 20.5855 15.8732 13.5036 11.8152 11.0977 54.8628 27.2386
temp: 298.150 k
press: 1.00000 atm
elementType: 16 8 7 7 7 7 6 6 6 6 6 6 6 6 6 1 1 1 1 1 1 1 1 1 1 1 1
symmnumber: 1
zpe: 536521.1 jmol-1
zpe.correction: 0.204350 hartree
zpe.thermalcorrener: 0.220838 hartree
zpe.thermalcorrenthalpy: 0.221782 hartree
zpe.thermalcorrgfe: 0.159473 hartree
zpe.sumelectzpe: -1041.340095 hartree
zpe.sumelectthermal: -1041.323608 hartree
zpe.sumelectthermalent: -1041.322664 hartree
zpe.sumelectthermalfe: -1041.384972 hartree
dipole: -2.6009 0.8508 -0.6752
dipole: 2.8186
quadrupole: -98.6518 -75.7222 -96.6891
quadrupole: 10.0022 1.4995 6.4441
quadrupole: -8.2975 14.6322 -6.3347 10.0022 1.4995 6.4441
hfenergy: -1041.5444456 hartree
pointgroup: C01 [X(C9H12N4O1S1)]
dipole: -1.0204774 0.3866846 -0.1970343 debye
polarizability: 218.4436475|-3.7724017|172.6424707|-6.7252591|3.1279169|86.74059 unknown
InChI: InChI=1S/C9H12N4OS/c1-5(2)12-8-6(7(10)14)4-11-9(13-8)15-3/h4H,10H2,1-3H3
charge 0 multiplicity 1
27 atoms
S  4.030642 -0.212774 0.120551
O  -2.700194 -0.775663 0.891818
N  -0.83878 1.182042 -0.391243
N  1.379843 0.47147 -0.037783
N  1.940708 -1.881313 0.298225
N  -2.234813 -2.751641 -0.231768
C  -0.408283 -1.182369 0.172667
C  0.03655 0.173362 -0.032404
C  -1.480666 2.038885 0.343629
C  0.607854 -2.156392 0.330982
C  2.249943 -0.557068 0.121953
C  -2.404267 3.028714 -0.32645
C  -1.404662 2.05803 1.859635
C  -1.858522 -1.528421 0.304943
C  4.024117 1.642757 -0.181192
H  0.346419 -3.202502 0.531905
H  -2.079903 4.06452 -0.111937
H  -3.427254 2.920354 0.08122
H  -2.425616 2.869671 -1.414663
H  -0.397615 1.785566 2.218338
H  -2.113622 1.293516 2.232783
H  -1.68886 3.04083 2.269683
H  -1.612285 -3.297206 -0.824816
H  -3.20403 -3.048171 -0.119366
H  5.084547 1.932502 -0.248524
H  3.528309 2.155772 0.654311
H  3.493541 1.86413 -1.117398
