program: Gaussian 09
title: 000295931
version: EM64L-G09RevD.01
frameworkgroup: C1[X(C19H19ClN6O)]
method: RPBEPBE
basis: SDD
operation: Freq
keyword: #p
keyword: freq=noraman
keyword: PBEPBE/SDD
title: #p freq=noraman PBEPBE/SDD
converged: YES YES NO NO
title: Mulliken charges:
elementType: Cl O N N N N N N C C C C C C C C C C C C C C C C C C C H H H H H H H H H H H H H H H H H H H
charge: -0.072344 -0.290954 -0.423012 -0.092474 -0.113969 -0.499260 -0.636590 -0.593259 0.282346 0.485196 0.048173 -0.513167 -0.379539 -0.427367 -0.383641 -0.450193 0.098589 0.125615 -0.776935 0.299111 -0.052196 0.509348 -0.445026 -0.355731 -0.040421 -0.189738 -0.263710 0.270446 0.228369 0.243051 0.266911 0.249213 0.233449 0.287853 0.249053 0.235121 0.232138 0.293277 0.341995 0.324006 0.244815 0.312899 0.231337 0.326723 0.323872 0.256622
chargesum: 0.00000
title: Mulliken charges with hydrogens summed into heavy atoms:
elementType: Cl O N N N N N N C C C C C C C C C C C C C C C C C C C
charge: -0.072344 -0.290954 -0.135159 -0.092474 -0.113969 -0.205983 0.029411 0.057336 0.282346 0.485196 0.048173 -0.014352 -0.136488 -0.160457 -0.134428 -0.216744 0.098589 0.125615 -0.060623 0.299111 -0.052196 0.509348 -0.200212 -0.042832 -0.040421 0.041599 -0.007088
polarizability: 4.27718570e+02 1.84019270e+00 2.54261417e+02 8.30232001e+00 -1.18654512e+01 1.77269093e+02
1716.lowfreq: -9.4967 -5.7726 -2.3140 -0.0010 -0.0008 0.0014 2.4669 10.9779 13.0025
frequency: -5.6967 10.8131 13.0015 41.3361 45.9110 54.0360 56.7408 69.7594 93.5922 104.9624 131.6057 155.9684 177.7853 183.1150 193.8488 207.3238 212.4428 230.1919 247.4661 272.4791 302.1399 306.8566 335.6815 350.8619 360.7734 398.2061 406.5359 409.7326 425.6750 437.8022 438.1940 446.6648 455.2649 504.1389 524.2309 528.7188 540.5666 554.3668 561.0907 572.9270 588.6657 602.3685 615.7951 617.2346 638.0565 660.5258 683.9650 684.7587 703.1234 712.4778 739.5758 746.4912 783.8441 787.8025 808.1350 844.7679 856.2405 858.2380 860.4959 909.7043 909.9533 934.4734 941.1275 966.4293 977.4133 980.5439 990.2243 991.1798 1016.5426 1027.0498 1040.6332 1067.4964 1071.9080 1074.6087 1097.1205 1100.5337 1119.9539 1133.6935 1178.8580 1189.4276 1207.4080 1216.1634 1236.1710 1258.4416 1275.0244 1300.2670 1302.3249 1309.5225 1333.4749 1366.2420 1372.2556 1378.1561 1392.9023 1408.0657 1411.0006 1429.9942 1454.9384 1468.7221 1471.8820 1474.8591 1477.8121 1482.7363 1508.0003 1512.8145 1518.2012 1558.6562 1568.9582 1584.0413 1597.5964 1612.9117 1614.7995 1619.3887 1644.9279 2980.6920 2988.7096 3042.0759 3076.0419 3112.3555 3116.6358 3125.9272 3140.0209 3140.1268 3145.1297 3149.9022 3178.6331 3200.7534 3526.6917 3543.5419 3546.7083 3563.4922 3698.0106 3724.3006
redmass: 4.8708 5.8381 8.2963 5.2322 5.1572 4.2060 6.7637 6.5210 1.1686 3.6225 5.4039 4.6399 4.7319 5.4152 4.4337 5.6788 6.4592 3.1984 5.7543 4.1410 4.9232 2.7034 2.9236 3.6192 5.8618 1.5925 2.5713 8.7123 3.1641 1.4186 2.5257 1.2412 3.0458 2.8846 1.2763 3.0733 1.2044 3.8911 3.7887 3.4496 3.4403 1.5509 4.4515 4.6963 6.1160 6.3887 4.6509 2.5738 10.1697 9.1675 4.9580 4.8230 8.1896 1.3071 3.9269 1.7281 1.5797 1.2643 4.8443 1.3653 3.6077 2.2544 2.5659 1.4251 5.9080 1.5119 3.1186 1.3085 2.4977 2.6498 1.5757 2.6320 2.2038 2.1435 1.5774 3.1201 1.5473 2.3107 1.0919 1.1358 1.7290 2.3994 1.3027 1.7320 4.2456 3.9613 1.5419 1.6398 2.1870 3.7611 2.3504 2.7916 1.4967 2.8932 3.5719 3.4591 1.1204 1.2266 1.1986 2.3795 2.5424 1.8229 2.8327 2.3359 4.3771 4.4951 6.3332 5.4242 1.4514 1.7044 6.2057 4.7065 4.3229 1.0628 1.0400 1.0983 1.0923 1.0879 1.1009 1.0874 1.0954 1.0922 1.0889 1.0969 1.0956 1.0952 1.0763 1.0442 1.0772 1.0439 1.1051 1.1059
irintensity: 0.3337 0.5223 0.1989 0.3706 0.3831 0.3554 7.0008 6.9078 0.2362 2.0534 1.6126 2.2487 0.8406 1.2459 11.7768 1.5925 5.3600 0.8241 7.8970 1.5002 5.1643 6.4712 1.0967 27.1193 3.2252 41.7891 4.1356 6.7110 5.9245 97.3556 45.0214 319.4943 23.2576 24.0800 3.2204 8.5122 26.6651 25.1175 25.1758 13.1844 27.1949 137.0022 17.0681 8.8350 2.2769 9.0635 7.5551 27.0836 9.3088 3.9786 6.1250 4.1988 15.6263 53.7538 15.6830 50.1577 47.8271 2.4411 29.2448 4.4662 1.1105 15.6338 5.0050 1.5828 17.0914 6.2480 14.3618 5.5570 0.6022 15.0643 5.4831 3.8387 20.8672 1.8860 21.2923 0.3258 11.1517 3.5852 6.0225 30.6162 335.2149 2.0766 222.8967 15.7214 2.3048 37.2708 4.1658 46.6485 17.9404 141.9264 18.9589 2.4919 21.4986 9.2815 25.7810 73.6799 23.9468 177.9309 56.8442 344.1936 40.8471 201.6239 39.2667 598.4675 234.8833 365.0941 36.8176 182.6396 638.4130 317.3295 105.3316 22.8058 172.9026 52.7847 12.1458 16.6088 14.5751 17.5893 18.1653 11.6703 22.8646 5.8393 9.6192 4.2377 2.8676 9.6802 5.3970 61.3910 27.7899 141.1301 57.2575 43.7888
temp: 298.150 k
press: 1.00000 atm
elementType: 17 8 7 7 7 7 7 7 6 6 6 6 6 6 6 6 6 6 6 6 6 6 6 6 6 6 6 1 1 1 1 1 1 1 1 1 1 1 1 1 1 1 1 1 1 1
symmnumber: 1
zpe: 934538.6 jmol-1
zpe.correction: 0.355947 hartree
zpe.thermalcorrener: 0.380397 hartree
zpe.thermalcorrenthalpy: 0.381342 hartree
zpe.thermalcorrgfe: 0.298844 hartree
zpe.sumelectzpe: -1597.364572 hartree
zpe.sumelectthermal: -1597.340121 hartree
zpe.sumelectthermalent: -1597.339177 hartree
zpe.sumelectthermalfe: -1597.421675 hartree
dipole: -2.7056 -1.1883 -2.0229
dipole: 3.5812
quadrupole: -171.7309 -163.9618 -158.4023
quadrupole: 3.1660 -3.1785 3.0702
quadrupole: -7.0325 0.7365 6.2960 3.1660 -3.1785 3.0702
hfenergy: -1597.7205187 hartree
pointgroup: C01 [X(C19H19Cl1N6O1)]
dipole: -1.0471516 0.6295015 0.7016392 debye
polarizability: 427.3787932|-7.0430837|247.3335628|-10.1709683|-25.0614091|184.5367248 unknown
InChI: InChI=1S/C19H19ClN6O/c1-11-16(17(21)26-18(22)24-11)13-7-5-12(6-8-13)10-23-19(27)25-15-4-2-3-14(20)9-15/h2-9,23,25H,10,21-22H2,1H3
charge 0 multiplicity 1
46 atoms
Cl 8.329417 -2.58002 1.058071
O  3.300382 1.916201 -1.151144
N  2.069347 1.497724 0.791027
N  -5.768993 -2.167674 0.501065
N  -6.653478 -0.13966 -0.542601
N  4.121287 0.412655 0.481943
N  -5.304575 1.701172 -0.977203
N  -8.01266 -2.001383 -0.144184
C  -2.948768 0.4053 0.202544
C  -0.384378 1.695459 0.354864
C  -4.282932 -0.257314 0.122069
C  0.968711 2.397069 0.412445
C  -1.804329 -0.148274 -0.439324
C  -2.77775 1.622074 0.921063
C  -0.546377 0.482375 -0.362488
C  -1.516476 2.253345 0.996902
C  -4.533372 -1.578452 0.586758
C  -5.414222 0.42884 -0.454743
C  -3.464232 -2.437517 1.229981
C  3.176837 1.318195 -0.039985
C  -6.769264 -1.414951 -0.060272
C  5.347852 0.003265 -0.103963
C  6.127242 -0.934991 0.629732
C  5.816639 0.478053 -1.359714
C  7.348487 -1.374523 0.095913
C  7.050219 0.008017 -1.856493
C  7.839663 -0.924239 -1.143315
H  1.249812 2.799587 -0.579124
H  0.916282 3.253862 1.112787
H  -1.914879 -1.074533 -1.014417
H  -3.635189 2.055762 1.449005
H  0.31806 0.040811 -0.872375
H  -1.411358 3.184533 1.568429
H  1.97556 0.976955 1.664379
H  -3.931792 -3.080427 1.993126
H  -2.999545 -3.105794 0.480045
H  -2.66416 -1.833537 1.687327
H  3.916714 -0.003529 1.392882
H  -4.411725 2.186001 -1.002896
H  -6.133966 2.114479 -1.39742
H  5.785314 -1.31447 1.599345
H  5.215587 1.197417 -1.917335
H  7.408071 0.376112 -2.824118
H  -8.132201 -2.947109 0.20705
H  -8.781853 -1.481907 -0.556756
H  8.794488 -1.283957 -1.535082
