program: Gaussian 09
title: 000295870
version: EM64L-G09RevD.01
frameworkgroup: C1[X(C7H10N2O4)]
method: RPBEPBE
basis: SDD
operation: Freq
keyword: #p
keyword: freq=noraman
keyword: PBEPBE/SDD
title: #p freq=noraman PBEPBE/SDD
converged: YES YES NO NO
title: Mulliken charges:
elementType: O O O O N N C C C C C C C H H H H H H H H H H
charge: -0.243289 -0.201471 -0.233536 -0.217814 -0.182708 -0.393005 -0.266387 0.193637 0.223596 0.260072 -0.601641 -0.261486 -0.658751 0.297725 0.341650 0.252091 0.265735 0.249757 0.236399 0.229341 0.218861 0.243427 0.247797
chargesum: 0.00000
title: Mulliken charges with hydrogens summed into heavy atoms:
elementType: O O O O N N C C C C C C C
charge: -0.243289 -0.201471 -0.233536 -0.217814 -0.182708 -0.051356 0.031338 0.193637 0.223596 0.260072 0.165943 0.204254 0.051334
polarizability: 1.29826746e+02 6.52041910e+00 9.69393503e+01 -1.03749168e+01 -3.19036194e+00 7.36518641e+01
1716.lowfreq: -18.0218 -6.6366 -2.5583 -0.0004 0.0001 0.0003 18.3633 47.2607 55.4835
frequency: 12.3155 47.2044 55.4787 72.8785 92.3084 123.9338 163.9519 185.5412 228.4768 256.4712 261.0571 300.4998 318.6481 362.4627 433.0923 467.1846 544.8897 580.4137 591.0171 673.6089 692.6813 709.5558 724.2848 779.7178 810.9880 839.9776 897.9958 947.7168 1004.7583 1058.9636 1096.1925 1106.8096 1132.5130 1137.8138 1158.2589 1180.6707 1221.4184 1250.6048 1273.7715 1307.0912 1351.2773 1368.1060 1375.3381 1393.2422 1440.5077 1458.5581 1461.6321 1472.6976 1483.2561 1484.8992 1644.3048 1662.4602 1728.7030 2996.7437 3003.4531 3032.8293 3035.7245 3092.1249 3096.1146 3099.8516 3121.5878 3125.1418 3611.7313
redmass: 3.5560 3.7027 5.3438 4.1079 1.0880 4.6416 7.3799 1.4159 3.6164 2.5218 3.3214 5.6206 4.3720 8.5942 3.5519 1.2856 4.5671 9.5848 8.1634 5.2104 5.4288 7.3315 7.5098 3.4600 1.3786 5.1287 4.5463 2.6310 2.6309 4.0245 2.2334 2.2239 1.3108 3.2324 1.7044 2.4198 2.0200 2.8172 1.1229 1.7399 1.2989 4.6995 1.6165 1.2245 1.3110 1.0774 1.0583 1.0414 1.0529 1.0664 9.2207 11.3188 9.6652 1.0362 1.0329 1.0606 1.0838 1.0985 1.1025 1.1018 1.1019 1.1063 1.0800
irintensity: 0.7706 1.2291 1.2991 1.6243 0.3056 2.6911 4.5361 3.1018 5.6435 1.6618 6.3938 0.8977 19.2020 23.6521 5.7324 157.5150 1.9759 7.8739 1.5246 17.3422 16.7964 34.4266 13.8717 2.3612 5.0307 8.2404 12.4747 45.6173 66.5978 40.5716 59.4482 98.3305 0.7459 281.9923 34.2445 37.3071 43.5388 58.0309 5.7166 43.4167 7.6742 136.9963 4.0895 25.2494 90.3956 19.5332 10.1299 18.3907 17.1428 14.6754 204.5360 594.8948 206.2155 12.9343 27.3537 30.1514 4.1441 26.6410 17.1659 5.4604 0.5110 26.9493 64.6782
temp: 298.150 k
press: 1.00000 atm
elementType: 8 8 8 8 7 7 6 6 6 6 6 6 6 1 1 1 1 1 1 1 1 1 1
symmnumber: 1
zpe: 458430.0 jmol-1
zpe.correction: 0.174607 hartree
zpe.thermalcorrener: 0.188239 hartree
zpe.thermalcorrenthalpy: 0.189184 hartree
zpe.thermalcorrgfe: 0.131882 hartree
zpe.sumelectzpe: -682.186867 hartree
zpe.sumelectthermal: -682.173234 hartree
zpe.sumelectthermalent: -682.172290 hartree
zpe.sumelectthermalfe: -682.229592 hartree
dipole: 2.7395 -0.0064 -1.3109
dipole: 3.0370
quadrupole: -70.2927 -78.6984 -76.9712
quadrupole: -8.9692 1.9567 8.4874
quadrupole: 5.0281 -3.3776 -1.6504 -8.9692 1.9567 8.4874
hfenergy: -682.3614738 hartree
pointgroup: C01 [X(C7H10N2O4)]
dipole: -1.0658348 -0.1258442 0.525178 debye
dipolederiv: -1.5731335 0.1875153 0.1581249 0.2296757 -0.3337907 -0.0373997 0.2107251 -0.0762099 -0.5363463 -0.6512258 0.2169773 0.1374727 0.2802427 -0.9119068 -0.2314286 0.1447826 -0.1108407 -0.3916852 -1.1389389 0.2034027 0.2926594 0.2708338 -0.6247141 -0.1068651 0.3713115 -0.0942203 -0.4892034 -0.6919796 -0.0572715 -0.0787411 0.0699489 -0.409323 -0.1980317 0.0782299 -0.3376087 -0.7607617 -1.1266161 0.3536136 0.3121951 0.1985582 -1.0678874 -0.1256767 0.4153892 -0.1751628 -0.3200662 -0.9188384 -0.2107921 0.1280798 -0.2065109 -0.5809372 0.1591248 0.150029 0.2278396 -0.5492135 -0.0151398 -0.3596278 -0.095008 -0.6162232 -0.2381892 -0.0235376 -0.1353321 -0.0188728 0.2295904 1.3722104 -0.3571731 -0.4399351 0.0233083 1.1508238 0.2841083 -0.5820931 0.1736032 0.3603831 1.6370487 -0.1790513 -0.5567979 -0.254873 1.5732943 0.0798676 -0.6331984 0.0717181 0.5414667 1.7747745 0.1123306 -0.0572168 -0.1742256 0.3229336 0.3302492 -0.2920525 0.5549771 0.9759432 0.21776 0.1972645 0.0075823 0.1999393 0.3195556 -0.0563242 0.0176434 -0.082165 0.2143474 0.8573513 -0.1043374 0.0261777 -0.0520132 0.3249023 -0.0757879 0.2301443 -0.0542085 0.2884989 -0.0881508 0.0239428 0.0032232 0.021034 -0.0950273 0.1031395 -0.0645279 0.0706029 -0.0169537 0.0429117 0.0202052 0.0465941 0.0455022 0.091599 0.0071518 0.0509188 -0.0013685 -0.0184175 0.1937462 -0.0297272 0.075089 -0.0005399 0.2376981 -0.0318028 0.0984579 -0.0735081 0.3301626 0.0360921 0.0458628 -0.0940309 -0.0254407 -0.0022779 0.0841205 -0.0329017 0.086544 0.0074973 0.0135829 -0.0074163 0.04915 0.0834142 0.1129298 -0.0431785 0.0568465 0.0022414 0.109012 0.081157 -0.0393649 0.0017694 -0.0872859 0.0019239 -0.04438 -0.0620469 -0.0923956 -0.0430791 0.0106272 0.048501 0.0035047 -0.0268733 -0.0683617 -0.0519569 -0.1000314 -0.0782509 0.0360153 -0.0665409 -0.0103544 0.0648466 0.0011125 0.0785862 0.0361338 0.0845919 0.0649786 -0.0518245 -0.1429499 0.011214 -0.0857865 0.0242825 0.09318 0.006191 -0.1081496 0.0177068 0.0916666 0.1387237 -0.0425326 -0.021845 -0.0133641 -0.0430241 -0.0653235 -0.0126098 -0.1003988 0.0082532 0.0375281 -0.0231814 0.1228925 0.0094973 0.0680126 0.0016064 0.1138731 0.0249991 -0.0152855 unknown
polarizability: 129.9722594|-3.2221265|95.3024644|-12.1468252|5.4670024|75.1432371 unknown
InChI: InChI=1S/C7H10N2O4/c1-3-13-6(11)4-5(10)9(2)7(12)8-4/h4,8H,3H2,1-2H3
charge 0 multiplicity 1
23 atoms
O  -2.292946 -0.364075 0.690911
O  0.030456 2.027855 0.772248
O  3.323409 -0.961236 -0.777044
O  -1.271584 -1.183119 -1.250627
N  1.880798 0.816531 -0.077205
N  1.202917 -1.31107 0.249507
C  0.083591 -0.499214 0.712362
C  0.617098 0.957928 0.492538
C  2.253947 -0.561857 -0.264884
C  -1.212456 -0.732754 -0.086195
C  2.750706 1.930494 -0.461645
C  -3.640678 -0.372611 0.026257
C  -3.861308 0.931136 -0.742771
H  -0.14132 -0.626559 1.78651
H  1.155589 -2.316547 0.097779
H  2.249963 2.568966 -1.208737
H  3.668766 1.500659 -0.892974
H  3.002228 2.545993 0.418533
H  -3.695252 -1.254919 -0.635465
H  -4.336606 -0.483221 0.872152
H  -4.894039 0.95615 -1.136921
H  -3.718149 1.803904 -0.083868
H  -3.166528 1.011169 -1.595458
