program: Gaussian 09
title: 000295930
version: EM64L-G09RevD.01
frameworkgroup: C1[X(C19H19N7O3)]
method: RPBEPBE
basis: SDD
operation: Freq
keyword: #p
keyword: freq=noraman
keyword: PBEPBE/SDD
title: #p freq=noraman PBEPBE/SDD
converged: YES YES NO NO
title: Mulliken charges:
elementType: O O O N N N N N N N C C C C C C C C C C C C C C C C C C C H H H H H H H H H H H H H H H H H H H
charge: -0.292017 -0.203868 -0.214401 -0.415981 -0.091981 -0.501234 -0.113091 -0.637030 -0.592639 0.017886 0.285773 0.484471 0.048715 -0.518775 -0.379354 -0.430131 -0.382519 -0.446764 0.098682 0.125218 -0.776917 0.302886 0.529137 -0.051876 -0.600298 -0.351814 0.426677 -0.169706 -0.393160 0.269078 0.230123 0.243670 0.269117 0.247961 0.233645 0.291211 0.250353 0.235152 0.231767 0.300488 0.278160 0.341740 0.324742 0.319776 0.238691 0.286503 0.327496 0.324441
chargesum: 0.00000
title: Mulliken charges with hydrogens summed into heavy atoms:
elementType: O O O N N N N N N N C C C C C C C C C C C C C C C C C C C
charge: -0.292017 -0.203868 -0.214401 -0.124771 -0.091981 -0.200746 -0.113091 0.029452 0.059298 0.017886 0.285773 0.484471 0.048715 -0.019574 -0.135684 -0.161014 -0.134558 -0.213119 0.098682 0.125218 -0.059646 0.302886 0.529137 -0.051876 -0.322138 -0.032038 0.426677 0.068985 -0.106657
polarizability: 4.46187781e+02 1.65277110e+00 2.62284423e+02 1.52505897e+01 -1.15950047e+01 1.87993918e+02
1716.lowfreq: -5.3798 -1.0126 -0.0006 0.0007 0.0008 3.2286 10.4299 12.6422 15.1498
frequency: 10.2687 12.6179 14.7810 41.1388 43.1527 52.7022 60.3535 63.0174 74.1562 97.3624 111.2441 133.4283 153.3261 170.9925 175.6494 189.8793 204.5989 211.4605 235.2066 248.8803 267.7838 300.9845 307.3651 324.3263 338.4066 355.7760 402.7236 404.7777 408.5171 426.2419 427.7958 438.0749 446.6310 455.4472 505.1700 518.4350 526.3304 529.7574 537.3098 541.6010 557.6867 574.5561 589.1522 605.9115 616.3837 618.1722 638.0170 652.2817 681.1077 683.2026 702.3490 708.0888 712.8241 729.2135 745.2688 778.8257 784.0692 809.5077 818.3135 849.1351 859.4950 884.9971 909.7052 910.5819 935.7799 946.8283 947.9991 966.8852 981.5943 984.2819 990.3898 1007.5151 1016.8757 1026.2345 1040.4472 1067.6346 1074.6210 1084.8260 1090.2163 1098.9444 1120.3649 1134.3745 1177.3113 1190.9180 1208.3862 1216.9480 1218.5129 1234.3648 1263.8585 1275.5451 1301.0150 1304.1784 1310.7301 1336.5204 1367.4261 1371.0656 1377.8673 1381.7982 1393.4300 1408.5696 1429.8800 1434.8611 1456.2833 1469.1054 1473.5464 1478.7920 1482.7053 1489.4069 1508.5515 1514.2460 1518.2232 1558.7133 1569.1031 1590.3661 1598.5229 1613.7940 1619.4947 1624.0251 1646.8810 2986.2947 2989.0804 3050.1228 3076.2107 3113.3172 3116.6946 3125.6967 3140.6073 3150.9663 3153.5123 3155.3555 3191.0665 3196.6458 3527.1188 3543.7155 3545.2792 3563.2094 3698.1955 3723.9086
redmass: 5.9660 7.6080 4.9580 5.7160 6.7833 6.2000 4.0845 9.2960 6.0695 4.1033 1.1621 4.8682 4.7545 5.3326 4.6077 4.9917 4.7710 6.4989 3.2752 5.7059 4.5675 5.2706 2.6967 4.2118 3.2472 3.8603 8.6994 2.0072 1.9959 3.3061 3.3481 1.2943 1.2192 2.8480 3.1911 5.6406 1.5766 2.2237 3.8773 1.1827 5.7320 3.3976 3.4125 1.4629 4.9925 3.4217 6.0557 7.3129 5.5884 2.4211 8.2386 6.3258 9.1567 6.4999 4.2965 7.9005 8.2650 3.8271 1.3772 1.7130 1.2448 4.5401 1.6276 3.6406 2.1464 2.5809 1.3700 1.4450 1.5297 5.8694 3.0843 1.3297 2.5021 2.7326 1.5767 2.6167 2.1473 1.8363 1.8062 3.1490 1.4791 2.2987 1.1547 1.1383 2.0190 2.6258 3.7558 1.3118 1.8462 4.2737 5.1137 1.4346 1.7655 2.0982 4.5270 2.3207 3.2295 5.1772 1.4923 2.9331 3.5432 4.1549 1.1209 1.2228 1.1974 2.4084 2.0233 2.2730 2.8272 2.3195 4.3781 4.5069 6.3553 6.0329 1.4589 1.7555 4.2143 6.2336 4.3268 1.0630 1.0400 1.0984 1.0923 1.0879 1.1009 1.0877 1.0955 1.0967 1.0899 1.0915 1.0932 1.0971 1.0765 1.0443 1.0773 1.0439 1.1051 1.1059
irintensity: 0.2526 0.2355 0.1929 0.6687 0.2456 4.1608 0.2922 10.0755 2.6078 3.7894 0.8772 2.3188 2.0029 0.7389 0.7272 9.5379 4.4910 4.6970 0.8027 9.4928 1.9546 4.2706 6.5813 2.7474 4.3487 19.4028 2.9580 35.8803 9.9898 9.3247 3.2405 22.2988 413.1022 22.3037 19.4075 3.2432 7.0956 8.3943 43.7492 32.2565 0.5879 13.4042 28.5785 126.5289 10.3492 34.7219 3.5095 5.4969 1.6830 19.2816 0.2649 49.5347 4.3759 10.6128 2.8966 22.2830 15.3526 13.9033 37.7098 39.7344 0.7184 6.8014 50.1906 1.3759 5.4352 2.0689 0.3026 0.3118 5.5818 3.3805 14.9208 4.2668 1.4136 12.8682 5.5442 4.5785 2.3361 16.1623 14.6344 8.1704 12.1805 3.1750 9.0208 40.4782 507.5945 62.2611 119.9798 214.4134 17.7712 3.0843 41.7422 1.1836 105.8784 17.1057 169.2781 6.3103 18.7928 72.7568 22.3764 11.3422 65.8288 13.4854 19.4051 152.2656 71.0483 57.7424 485.8844 47.7455 54.7936 732.9539 238.0966 374.6265 39.9713 23.0483 650.5783 266.2718 61.2169 49.0753 209.5526 49.0300 12.2366 13.2717 14.3660 16.9782 18.0116 12.7738 18.6816 4.2916 10.6915 8.7823 11.5462 4.8708 5.2012 60.8243 33.4355 145.0702 57.4004 44.2483
temp: 298.150 k
press: 1.00000 atm
elementType: 8 8 8 7 7 7 7 7 7 7 6 6 6 6 6 6 6 6 6 6 6 6 6 6 6 6 6 6 6 1 1 1 1 1 1 1 1 1 1 1 1 1 1 1 1 1 1 1
symmnumber: 1
zpe: 963976.4 jmol-1
zpe.correction: 0.367159 hartree
zpe.thermalcorrener: 0.393780 hartree
zpe.thermalcorrenthalpy: 0.394724 hartree
zpe.thermalcorrgfe: 0.305911 hartree
zpe.sumelectzpe: -1342.278171 hartree
zpe.sumelectthermal: -1342.251550 hartree
zpe.sumelectthermalent: -1342.250606 hartree
zpe.sumelectthermalfe: -1342.339419 hartree
dipole: -5.2285 -3.4435 -1.0248
dipole: 6.3439
quadrupole: -200.8654 -173.7135 -163.2568
quadrupole: -15.6657 6.1693 7.6103
quadrupole: -21.5869 5.5651 16.0218 -15.6657 6.1693 7.6103
hfenergy: -1342.6453299 hartree
pointgroup: C01 [X(C19H19N7O3)]
dipole: -2.075251 1.3658105 0.2393933 debye
polarizability: 445.5108223|-1.2883683|257.0449098|-19.9911585|-22.3835847|193.9103895 unknown
InChI: InChI=1S/C19H19N7O3/c1-11-16(17(20)25-18(21)23-11)13-7-5-12(6-8-13)10-22-19(27)24-14-3-2-4-15(9-14)26(28)29/h2-9,22,24H,10,20-21H2,1H3
charge 0 multiplicity 1
48 atoms
O  2.586471 2.282231 -1.199063
O  8.839979 -2.062926 0.044102
O  7.284017 -2.221245 1.702622
N  1.406145 1.725553 0.740258
N  -6.164676 -2.417281 0.34996
N  3.508956 0.7656 0.365253
N  -7.262949 -0.332034 -0.305142
N  -6.075306 1.645791 -0.573161
N  -8.46413 -2.326352 -0.074718
N  7.705636 -1.750949 0.574166
C  -3.545916 0.372137 0.209873
C  -1.060568 1.809609 0.353665
C  -4.838425 -0.368384 0.137667
C  0.251997 2.582574 0.417186
C  -2.422354 -0.014151 -0.575948
C  -3.394419 1.498154 1.067692
C  -1.202625 0.687573 -0.502897
C  -2.172281 2.202762 1.137403
C  -4.964613 -1.757775 0.420209
C  -6.057796 0.307631 -0.236573
C  -3.791861 -2.619731 0.840761
C  2.505911 1.638418 -0.109528
C  4.744317 0.45379 -0.253095
C  -7.256646 -1.667856 -0.008948
C  5.594683 -0.457489 0.422914
C  5.161723 1.005422 -1.499506
C  6.833081 -0.795718 -0.154068
C  6.411045 0.638963 -2.043474
C  7.270509 -0.265304 -1.386345
H  0.493121 3.043058 -0.558844
H  0.17037 3.400887 1.158976
H  -2.520542 -0.865709 -1.258433
H  -4.232537 1.800392 1.706433
H  -0.354846 0.373618 -1.123624
H  -2.081001 3.061477 1.814932
H  1.348497 1.159066 1.58817
H  -4.150864 -3.40193 1.528838
H  -3.352087 -3.132623 -0.035793
H  -2.994854 -2.032233 1.324324
H  3.34495 0.305792 1.263433
H  5.32147 -0.909544 1.382186
H  -5.219524 2.192862 -0.606692
H  -6.963656 2.050608 -0.860054
H  4.502276 1.707333 -2.012876
H  6.716274 1.072076 -3.001538
H  8.240278 -0.55846 -1.794332
H  -8.492468 -3.31836 0.142699
H  -9.299059 -1.812126 -0.33977
