program: Gaussian 09
title: 000295927
version: EM64L-G09RevD.01
frameworkgroup: C1[X(C20H32O4)]
method: RPBEPBE
basis: SDD
operation: Freq
keyword: #pfreq=noraman
keyword: PBEPBE/SDD
title: #p freq=noraman PBEPBE/SDD
converged: YES YES NO NO
title: Mulliken charges:
elementType: O O O O C C C C C C C C C C C C C C C C C C C C H H H H H H H H H H H H H H H H H H H H H H H H H H H H H H H H
charge: -0.208941 -0.445900 -0.416689 -0.230347 -0.318644 0.524088 -0.572764 -0.571962 -0.402510 -0.362043 -0.541878 -0.222072 0.119496 -0.375592 -0.154494 -0.233844 -0.435564 -0.362977 -0.373503 -0.357280 -0.488892 -0.343902 -0.693311 0.172036 0.246953 0.229740 0.221040 0.251289 0.257992 0.217962 0.208468 0.193622 0.202054 0.281219 0.255511 0.194381 0.193788 0.204094 0.220085 0.215918 0.253800 0.197179 0.194847 0.218977 0.219528 0.187123 0.192886 0.253294 0.253083 0.184972 0.196656 0.336496 0.207462 0.211666 0.218756 0.376648
chargesum: 0.00000
title: Mulliken charges with hydrogens summed into heavy atoms:
elementType: O O O O C C C C C C C C C C C C C C C C C C C C
charge: -0.208941 -0.109403 -0.040041 -0.230347 -0.071691 0.524088 -0.121985 -0.062681 0.023919 0.033632 -0.260659 0.033439 0.119496 0.012578 0.049600 0.019955 0.000439 0.029050 0.065002 0.022729 0.017485 0.037726 -0.055427 0.172036
polarizability: 2.66811271e+02 -3.51206735e+01 2.32780839e+02 -2.17650680e-01 -1.64345516e+01 2.03751242e+02
1716.lowfreq: -20.8598 -4.5987 -0.0002 0.0004 0.0008 3.6280 7.8843 11.5619 12.9305
frequency: -18.4323 11.1472 12.6516 13.8859 30.9095 38.3654 39.7970 48.4337 59.3003 70.1567 77.6670 90.0140 92.8437 99.8162 118.1563 132.3300 141.3614 147.4396 156.2276 176.5998 189.5916 203.8316 227.4038 231.1753 248.3537 289.0914 315.4794 323.0808 349.7672 362.2982 367.5978 388.7761 411.4211 444.5243 478.5046 491.8223 501.8136 510.2597 525.6149 540.8488 585.6334 594.1231 628.0060 639.8331 670.3744 718.8837 724.3351 739.3370 759.0664 786.3240 818.8552 831.4391 842.6509 857.7658 863.5853 866.6872 878.8059 883.4305 912.4006 924.8881 941.7932 952.7753 968.5963 985.6694 993.7442 1008.0598 1018.9115 1024.1753 1038.1399 1043.1636 1063.3140 1069.0559 1080.6188 1081.8490 1096.3221 1100.3032 1103.4379 1109.2548 1121.8375 1135.3745 1154.5359 1166.3024 1175.6196 1194.8896 1205.2573 1210.5533 1215.4219 1217.0231 1232.4135 1242.5887 1246.5450 1250.7199 1256.4643 1264.0209 1278.8919 1279.5619 1281.5551 1282.7956 1287.0661 1291.6298 1293.5079 1298.7664 1313.7790 1314.2304 1325.1091 1333.0493 1344.5235 1347.2329 1354.0829 1361.1382 1369.3240 1375.9600 1387.8010 1434.8590 1437.0297 1453.7220 1459.9707 1463.4672 1464.4223 1464.6563 1465.4542 1475.8548 1476.7182 1477.0773 1485.9542 1486.7810 1616.3041 1631.4068 1667.4449 1668.9671 2950.9148 2953.2726 2954.2384 2957.0726 2957.5177 2959.3097 2964.9161 2972.2012 2972.3779 2977.6663 2985.1062 2987.1036 2991.8593 2992.1935 2996.1449 3008.7373 3011.3473 3011.4554 3025.9786 3031.9970 3033.0184 3049.2431 3050.0511 3062.3949 3062.8210 3067.7422 3072.5155 3076.1799 3081.3900 3177.3317 3512.6510 3549.0412
redmass: 2.5495 5.1557 4.1972 8.4406 3.3810 5.2544 3.0967 3.4725 2.2099 2.5340 4.3087 3.2500 3.2427 2.7433 2.3739 2.1389 3.5783 2.0475 6.1706 4.4768 2.4682 3.1085 1.1917 4.3841 2.2312 3.2395 3.1638 3.7661 1.1927 3.2534 2.8084 2.4727 3.5344 3.8393 3.4778 3.0480 1.7986 2.8921 3.2540 3.1258 4.2645 3.8722 5.8208 1.3076 3.2645 1.1151 1.0803 1.1539 1.2869 1.3102 2.8547 1.6530 2.4198 4.7142 2.1317 1.4598 1.4980 1.8178 1.8970 2.0956 2.0813 2.8241 1.3734 1.1142 4.3269 3.6067 3.1056 2.1835 1.8063 2.6259 2.9798 2.4571 1.9329 1.7987 2.9485 1.8866 2.1358 1.7436 1.3391 1.6859 2.1627 1.7222 1.6327 1.7046 1.4472 1.4815 1.4577 1.2991 1.4197 1.6151 1.4886 1.3443 1.3248 1.2641 1.2550 1.4550 1.1398 1.2404 1.0888 1.2321 1.1509 1.0968 1.2307 1.7676 1.5689 1.4535 1.4804 1.4560 1.5596 1.6231 1.6330 1.8233 1.2164 1.0821 1.0851 1.0882 1.0750 1.0659 1.0824 1.0824 1.0840 1.0730 1.0658 1.0691 1.0807 1.0996 7.7893 11.4868 6.7289 8.2472 1.0703 1.0591 1.0630 1.0639 1.0685 1.0594 1.0612 1.0408 1.0723 1.0644 1.0687 1.0613 1.0947 1.0929 1.0598 1.0980 1.0993 1.0635 1.0989 1.1033 1.0997 1.1028 1.1029 1.0916 1.1032 1.1004 1.0994 1.0999 1.0889 1.0976 1.0640 1.0661
irintensity: 0.0357 0.1329 0.4351 0.9750 0.6276 3.2441 0.1508 1.6844 0.3980 0.4990 0.3310 0.3452 0.3752 0.8766 0.0040 0.1778 0.7265 0.0285 2.1649 0.8482 0.2343 1.7641 0.0279 1.3294 2.1328 7.4653 8.6237 5.1566 117.7185 31.2677 3.5571 0.8568 1.1297 13.4584 20.1673 14.1358 26.6391 1.4560 4.2107 1.2946 16.7578 12.5429 4.7061 127.8404 6.1143 12.8517 18.0559 0.4966 0.3270 5.0108 4.2632 4.9316 7.2843 1.0916 2.0019 9.0528 6.8198 8.5199 1.1010 24.8455 41.6793 61.4359 0.9026 51.2902 46.0403 29.9718 50.0128 5.0591 25.8905 136.4665 7.9754 0.5102 14.7342 3.5434 25.0879 6.6002 3.0798 18.7929 2.8639 10.4617 9.6163 1.5058 42.0149 7.0864 18.4781 1.7082 38.1395 17.9038 6.8736 16.3697 5.1765 1.9644 1.9536 0.7579 0.5841 9.5979 1.2286 0.5813 1.3963 6.4681 0.0729 0.4468 12.6328 42.3123 12.4449 0.5374 12.4668 10.4229 5.0149 5.2970 21.9531 30.3388 11.0396 15.1100 26.7790 3.4564 3.7688 1.6243 2.0135 1.4707 6.2839 2.8454 5.0783 8.0171 17.2426 21.9519 213.2194 275.0240 6.7431 202.4452 18.2275 2.1607 1.6222 11.8097 6.9608 43.6686 123.7240 40.2336 13.7542 47.7530 16.1146 4.8154 2.7023 7.8828 37.8750 4.8465 8.0679 9.1130 8.9997 101.1458 1.0190 92.0224 25.5384 11.8554 88.6193 90.7545 46.4217 8.1479 28.0964 4.3509 20.1751 5.6936
temp: 298.150 k
press: 1.00000 atm
elementType: 8 8 8 8 6 6 6 6 6 6 6 6 6 6 6 6 6 6 6 6 6 6 6 6 1 1 1 1 1 1 1 1 1 1 1 1 1 1 1 1 1 1 1 1 1 1 1 1 1 1 1 1 1 1 1 1
symmnumber: 1
zpe: 1260023.1 jmol-1
zpe.correction: 0.479917 hartree
zpe.thermalcorrener: 0.507560 hartree
zpe.thermalcorrenthalpy: 0.508504 hartree
zpe.thermalcorrgfe: 0.415695 hartree
zpe.sumelectzpe: -1080.311380 hartree
zpe.sumelectthermal: -1080.283737 hartree
zpe.sumelectthermalent: -1080.282793 hartree
zpe.sumelectthermalfe: -1080.375602 hartree
dipole: -3.1039 1.2049 -0.8825
dipole: 3.4445
quadrupole: -168.3076 -166.4597 -152.8461
quadrupole: 22.8338 4.5671 8.6777
quadrupole: -5.7698 -3.9219 9.6917 22.8338 4.5671 8.6777
hfenergy: -1080.7912971 hartree
pointgroup: C01 [X(C20H32O4)]
dipole: -1.1695966 -0.6449239 0.2294174 debye
polarizability: 256.2687158|39.1076338|243.9073173|8.2674248|-11.4026476|203.1673179 unknown
InChI: InChI=1S/C20H32O4/c1-2-3-6-10-18(21)13-12-17-15-19(22)14-16(17)9-7-4-5-8-11-20(23)24/h12-14,17-18,21,23H,2-11,15H2,1H3
charge 0 multiplicity 1
56 atoms
O  4.81959 4.4456 -0.096826
O  3.446316 -2.890879 2.653122
O  -7.684577 -0.116095 0.809698
O  -6.708381 -0.639262 -1.230581
C  2.753865 1.541747 0.886494
C  2.09846 2.158496 -0.369063
C  0.838716 1.5847 -0.964617
C  4.064521 2.367098 1.063635
C  -0.380756 1.607662 0.001367
C  -1.648901 1.02046 -0.656081
C  2.796414 3.24854 -0.817219
C  2.978718 0.046954 0.760615
C  3.993446 3.499186 0.016554
C  -2.877022 1.021768 0.281046
C  2.715876 -2.379058 1.462665
C  2.471454 -0.893373 1.60083
C  1.416384 -3.207622 1.423163
C  0.473263 -2.87789 0.242592
C  -4.132906 0.419622 -0.386161
C  1.038319 -3.223131 -1.155418
C  -5.353245 0.42924 0.553388
C  0.017451 -2.984179 -2.29178
C  0.573008 -3.33309 -3.689171
C  -6.597497 -0.161291 -0.080762
H  2.081559 1.713771 1.751997
H  0.580186 2.128694 -1.892473
H  1.022452 0.526386 -1.24831
H  4.181697 2.783445 2.078899
H  4.963386 1.754342 0.863725
H  -0.5734 2.650198 0.324529
H  -0.139825 1.027167 0.914327
H  -1.441167 -0.019576 -0.985041
H  -1.887559 1.595738 -1.574507
H  2.533492 3.877441 -1.671536
H  3.606661 -0.272242 -0.087859
H  -3.089429 2.062064 0.605129
H  -2.635087 0.450579 1.201871
H  3.319989 -2.566505 0.549001
H  1.7016 -4.27722 1.394321
H  0.889731 -3.044153 2.383847
H  1.853281 -0.591371 2.461002
H  0.204787 -1.800913 0.271915
H  -0.473149 -3.437563 0.38806
H  -4.375653 0.982052 -1.308142
H  -3.926106 -0.61892 -0.708556
H  1.948749 -2.62266 -1.359763
H  1.357878 -4.286153 -1.167916
H  -5.597264 1.458517 0.882372
H  -5.146604 -0.137347 1.482823
H  -0.304045 -1.921359 -2.275397
H  -0.893562 -3.585106 -2.093524
H  4.263495 -2.34256 2.776068
H  1.46541 -2.723438 -3.926982
H  0.872009 -4.396971 -3.741278
H  -0.178258 -3.154499 -4.480164
H  -8.48507 -0.509936 0.366967
