program: Gaussian 09
title: 000295852
version: EM64L-G09RevD.01
frameworkgroup: C1[X(C9H12N2OS)]
method: RPBEPBE
basis: SDD
operation: Freq
keyword: #p
keyword: freq=noraman
keyword: PBEPBE/SDD
title: #p freq=noraman PBEPBE/SDD
converged: YES YES NO NO
title: Mulliken charges:
elementType: S O N N C C C C C C C C C H H H H H H H H H H H H
charge: 0.235579 -0.252885 -0.345276 0.028548 -0.660964 0.278565 0.531603 0.111476 -0.403891 -0.814012 -0.213026 -0.706492 -0.804546 0.202042 0.250272 0.253709 0.343213 0.219281 0.235855 0.231938 0.240058 0.216643 0.288109 0.288205 0.245995
chargesum: 0.00000
title: Mulliken charges with hydrogens summed into heavy atoms:
elementType: S O N N C C C C C C C C C
charge: 0.235579 -0.252885 -0.002063 0.028548 -0.208650 0.278565 0.531603 0.111476 -0.150181 -0.126938 -0.213026 -0.249791 0.017762
polarizability: 1.96547227e+02 1.96292600e+01 1.31038067e+02 3.82158190e+00 -1.11593695e+01 8.15275469e+01
1716.lowfreq: -5.8982 -3.6008 -0.0017 -0.0009 0.0016 11.0099 35.5897 50.7255 56.5225
frequency: 35.3529 50.5815 56.5157 63.9448 86.4748 133.2430 154.4004 161.8476 187.7823 241.7248 277.0600 328.4446 363.0689 386.7468 401.2590 424.7424 482.4746 531.6420 543.9241 630.6559 648.9523 660.6042 698.5722 719.1440 758.1818 786.2866 819.2482 891.0419 928.1869 933.0556 949.9879 972.7078 986.6606 995.9203 1015.4003 1048.3349 1069.7780 1118.6455 1167.7089 1218.9522 1257.8667 1282.7775 1294.1773 1344.2067 1364.3242 1391.4630 1413.5930 1428.0306 1431.7914 1449.1507 1453.6309 1464.6615 1478.1354 1511.3041 1555.4792 1637.3018 1671.9385 2961.8745 2989.6822 3030.2094 3034.6898 3068.1601 3085.2796 3093.0997 3137.2552 3157.5390 3166.4050 3200.1443 3488.4826
redmass: 3.0621 3.4118 4.1765 3.8415 1.1615 4.9639 3.4512 6.7263 1.0665 3.8921 6.9154 5.2419 4.5358 2.2765 2.6557 2.5250 4.7811 3.5704 7.3146 4.9973 3.4741 6.3190 2.2159 1.7225 2.0713 3.5962 3.4443 2.7663 1.5707 2.1854 1.3384 1.6874 1.1741 1.2706 1.5357 1.5231 4.9585 3.5528 1.3743 3.4361 2.2137 2.6847 1.3667 1.1362 1.7927 1.2264 2.5296 1.1850 1.0521 1.0591 1.0914 1.0536 1.0634 5.0552 5.8904 7.0742 5.0648 1.0376 1.0625 1.0278 1.0965 1.0989 1.0980 1.0631 1.0927 1.1045 1.1062 1.1143 1.0777
irintensity: 0.1581 1.7495 0.0748 0.9059 0.0592 0.1280 1.6624 11.9280 0.6837 1.6381 0.7275 4.6653 3.5920 3.8636 6.3586 11.5033 2.9493 29.8857 1.6753 5.6207 3.5519 6.4146 2.4585 26.0598 52.6058 15.6275 11.0730 6.0184 9.8274 23.1408 78.2907 1.1560 8.9550 6.0523 14.3517 3.7244 3.6671 44.2499 19.5318 88.5430 32.9256 34.1718 1.2917 7.7556 0.4379 25.1663 10.0048 2.3768 15.0900 9.8778 12.3657 22.8509 19.2749 506.6598 5.0226 377.6758 38.9145 25.3680 34.0465 17.9224 31.1912 5.8484 29.3268 9.0852 28.2903 5.3714 7.3998 18.6385 34.4253
temp: 298.150 k
press: 1.00000 atm
elementType: 16 8 7 7 6 6 6 6 6 6 6 6 6 1 1 1 1 1 1 1 1 1 1 1 1
symmnumber: 1
zpe: 513029.9 jmol-1
zpe.correction: 0.195403 hartree
zpe.thermalcorrener: 0.209523 hartree
zpe.thermalcorrenthalpy: 0.210467 hartree
zpe.thermalcorrgfe: 0.152893 hartree
zpe.sumelectzpe: -931.962315 hartree
zpe.sumelectthermal: -931.948195 hartree
zpe.sumelectthermalent: -931.947251 hartree
zpe.sumelectthermalfe: -932.004824 hartree
dipole: -2.4091 -2.7578 0.0415
dipole: 3.6621
quadrupole: -77.6120 -87.2554 -84.7704
quadrupole: -3.9318 0.8697 -0.9438
quadrupole: 5.6006 -4.0428 -1.5578 -3.9318 0.8697 -0.9438
hfenergy: -932.1577179 hartree
pointgroup: C01 [X(C9H12N2O1S1)]
dipole: 0.9556646 1.0769404 -0.0522587 debye
dipolederiv: -0.7705322 -0.1359054 0.1605127 0.0563929 -0.0711947 -0.0067391 0.266407 0.0535891 -0.1435442 -0.746716 -0.2803171 0.0433698 -0.4952459 -1.0243455 0.0232652 -0.0089581 -0.0641496 -0.359705 -1.0053333 -0.4752303 0.1352326 -0.0452316 -0.427921 -0.0207494 0.2791502 0.1071648 -0.2756663 -1.2409746 -0.093798 0.2764533 0.820588 -0.5340381 -0.3587226 0.68316 -0.0847682 -0.404823 -0.1249588 0.0131781 -0.0460176 0.0316194 0.0469742 0.0541898 -0.2022904 0.0994171 0.1305264 0.1457156 -0.0539559 0.0015776 -0.4035857 -0.5415996 0.0133733 -0.1903452 -0.1453398 -0.1307307 0.1253584 0.0418597 0.1795653 -0.0277307 0.2887216 -0.0706814 0.4442234 -0.1072821 0.0312646 1.0605665 0.4629991 -0.1687763 0.6512426 1.1592488 0.0027554 -0.084317 0.1131969 0.2667755 0.8146997 0.1967986 -0.2315714 -0.076974 0.3884814 0.1600829 -0.3473051 0.0804347 0.0735612 -0.0033464 -0.0294061 -0.0427814 0.009644 -0.1269726 0.07504 -0.1161405 0.0675415 0.0405614 1.4310479 0.2153277 -0.3994549 -0.6672956 0.5655048 0.3266946 -0.7346177 0.0885261 0.3032711 -0.3715619 -0.0586348 0.1789388 0.017878 -0.12493 -0.1058042 0.1302131 -0.0814536 -0.1727778 0.1155291 0.1097457 0.014597 0.1570289 0.1550702 -0.0108293 0.0254246 -0.0048309 0.0416113 0.0182819 -0.0135196 -0.0195231 0.0450477 -0.0292774 -0.1566645 0.010066 -0.0871907 -0.0429215 0.0240662 -0.0110645 0.0261365 -0.0449548 -0.0316401 0.1156827 0.0027291 0.0272055 0.0541145 0.0528565 0.0535323 0.054922 0.1052639 -0.0307902 -0.0760131 0.0640818 -0.0660147 0.0825118 0.1791306 -0.0049566 0.047586 0.002618 0.1981756 -0.0440809 0.0504669 -0.0354216 0.2930734 0.0945475 0.0407964 0.0286826 0.0188856 -0.0467466 -0.0832048 0.0718521 -0.1313664 -0.0573532 -0.1061813 -0.0871558 0.0730264 -0.0869579 0.0489069 0.0049522 0.079238 0.0194677 0.0862918 -0.0190345 0.060452 -0.1296232 0.0149697 0.0688336 0.0124905 -0.1381509 0.0681768 -0.0402207 0.1721729 0.0173301 -0.0543277 0.000022 -0.0552372 0.0625787 -0.0401531 0.0692307 0.0972609 0.0526038 0.0099141 -0.1431311 0.0219713 0.0755296 0.0709956 -0.2143466 0.0438407 0.0140831 0.1252432 -0.0049175 0.0103737 -0.0796427 0.0139366 -0.0362217 -0.0313434 -0.0368799 -0.0548232 0.0697359 0.0539535 -0.0653194 -0.0136277 -0.0485532 0.0605214 -0.0763174 0.0135096 0.0649106 -0.0929165 -0.0270259 0.0695519 -0.0119253 0.0838628 -0.012911 0.0772732 -0.0066038 0.1027479 unknown
polarizability: 194.7754924|20.5611717|129.9412864|-15.5007623|10.6400099|84.3960621 unknown
InChI: InChI=1S/C9H12N2OS/c1-6(2)4-7-5-10-9(13-3)11-8(7)12/h5,11H,1,4H2,2-3H3
charge 0 multiplicity 1
25 atoms
S  3.658546 -0.428112 -1.120274
O  -0.888993 -2.357475 -0.069546
N  1.154705 -1.299663 -0.487739
N  1.605799 0.965927 0.082119
C  -2.05369 0.128144 1.024769
C  -0.622319 0.001131 0.537803
C  -3.022058 0.482699 -0.115489
C  -0.201368 -1.297156 -0.006639
C  0.299395 1.039942 0.567942
C  -3.003659 1.926967 -0.580904
C  1.987052 -0.194734 -0.433352
C  -3.832076 -0.45833 -0.666578
C  4.366416 1.284963 -0.802383
H  -2.106084 0.908353 1.809509
H  -2.356576 -0.833995 1.473215
H  0.027642 2.011242 0.996196
H  1.480228 -2.192501 -0.876356
H  -3.297953 2.612103 0.23918
H  -1.988507 2.229983 -0.904058
H  -3.692849 2.089649 -1.426982
H  -3.809528 -1.499617 -0.32741
H  -4.519633 -0.213941 -1.485283
H  4.350469 1.490711 0.276115
H  3.76487 2.031789 -1.337174
H  5.396474 1.247822 -1.188777
