program: Gaussian 09
title: 000295850
version: EM64L-G09RevD.01
frameworkgroup: C1[X(C7H8N2OS)]
method: RPBEPBE
basis: SDD
operation: Freq
keyword: #p
keyword: freq=noraman
keyword: PBEPBE/SDD
title: #p freq=noraman PBEPBE/SDD
converged: YES YES NO NO
title: Mulliken charges:
elementType: S O N N C C C C C C C H H H H H H H H
charge: 0.297685 -0.214918 -0.108708 0.061538 -0.459263 -0.309315 -0.223727 -0.623459 -0.085655 -0.305074 -0.017786 0.282012 0.265784 0.232592 0.215962 0.247419 0.242025 0.249243 0.253647
chargesum: 0.00000
title: Mulliken charges with hydrogens summed into heavy atoms:
elementType: S O N N C C C C C C C
charge: 0.297685 -0.214918 -0.108708 0.061538 -0.177251 0.189060 -0.223727 0.081947 0.163588 -0.051427 -0.017786
polarizability: 1.59027650e+02 -6.76151945e+00 1.02763255e+02 7.58772335e+00 -7.81338514e-01 6.10156529e+01
1716.lowfreq: -9.2368 0.0011 0.0012 0.0018 6.1154 9.9108 65.7296 93.4223 161.0543
frequency: 65.7121 93.4113 161.0543 219.2821 229.8731 268.3192 328.0115 336.0605 416.3833 416.9550 455.2181 522.9249 548.4313 611.9729 642.6029 678.1961 723.9601 768.6802 815.5223 842.8287 873.7193 933.5268 951.2624 988.6456 1016.3018 1060.8209 1087.4145 1112.8691 1182.2318 1199.0434 1209.5826 1234.1922 1292.3766 1322.7179 1366.3778 1396.3474 1399.3926 1461.3184 1471.2113 1472.2729 1499.1794 1608.5207 1629.3831 2980.8557 2987.7799 3060.0582 3070.8026 3083.9250 3105.6310 3159.4366 3196.7594
redmass: 5.1205 3.3483 9.0595 4.3235 1.0784 5.8797 3.7999 2.2624 3.5572 10.3214 6.4230 5.8358 5.6029 6.2957 3.9831 8.8312 3.4210 4.8675 1.8424 6.7866 2.6819 1.5511 1.2966 2.5030 1.6840 3.0593 1.7923 1.9476 1.4605 1.5267 3.0691 1.6147 1.3925 1.4083 1.5736 2.2941 1.4529 1.0529 1.0482 1.0787 9.8334 9.6511 7.1801 1.0389 1.0604 1.1024 1.0942 1.0922 1.0993 1.0909 1.0981
irintensity: 1.1609 1.0903 1.0201 1.6703 0.2326 0.8079 2.6715 0.3117 1.1099 12.2087 3.5017 2.8127 6.8254 2.3471 4.2073 6.8874 1.1602 0.7389 58.6776 0.3335 3.0009 2.8326 0.7330 52.8724 26.1454 10.5828 0.3887 14.3693 36.0289 19.6606 39.0238 36.4628 54.2372 16.4797 43.7178 66.0307 54.7067 30.0177 10.2887 5.6102 409.0700 15.2817 563.2951 20.2668 42.4498 11.9466 5.7229 27.3529 19.7611 4.1556 4.1247
temp: 298.150 k
press: 1.00000 atm
elementType: 16 8 7 7 6 6 6 6 6 6 6 1 1 1 1 1 1 1 1
symmnumber: 1
zpe: 374188.0 jmol-1
zpe.correction: 0.142521 hartree
zpe.thermalcorrener: 0.152231 hartree
zpe.thermalcorrenthalpy: 0.153175 hartree
zpe.thermalcorrgfe: 0.107134 hartree
zpe.sumelectzpe: -853.514499 hartree
zpe.sumelectthermal: -853.504789 hartree
zpe.sumelectthermalent: -853.503845 hartree
zpe.sumelectthermalfe: -853.549885 hartree
dipole: -7.3591 6.5760 -0.9653
dipole: 9.9163
quadrupole: -82.0565 -70.9661 -71.6224
quadrupole: 7.0719 -1.7996 -0.5328
quadrupole: -7.1748 3.9155 3.2593 7.0719 -1.7996 -0.5328
hfenergy: -853.6570196 hartree
pointgroup: C01 [X(C7H8N2O1S1)]
dipole: 3.0544066 -2.4236163 -0.1320159 debye
dipolederiv: -0.7252263 -0.133504 -0.0011677 -0.2029232 -0.075578 0.024394 0.0773751 0.0314848 -0.1135646 -1.3524347 0.21753 0.1016635 0.3232859 -0.5155941 -0.0335447 0.1241424 -0.0205947 -0.3819007 -1.1575526 0.0625279 0.1688749 -0.4948923 -0.861999 0.0751555 0.0924954 0.0805591 -0.1057735 -1.8050257 -0.0029839 0.1627055 -0.1204292 -0.372161 0.0173545 0.2205392 0.0117933 -0.2499606 0.3366402 -0.1567637 0.1215636 -0.2807589 0.1273501 -0.0856704 0.119132 -0.0545989 0.2205385 0.4633815 -0.1210575 -0.1440679 -0.1012343 0.1182426 0.0184026 -0.0976071 0.0483681 0.2839459 1.8046116 0.0567229 -0.1744626 0.1121243 0.8104149 0.019196 -0.2509988 -0.04458 0.0379483 -0.0379402 -0.0159385 -0.0662091 0.0618695 0.0011956 0.0269003 -0.0358499 -0.0190879 -0.0933852 0.8930708 0.1026886 -0.134693 0.3590947 0.2759446 -0.0706555 -0.1402684 -0.0552106 -0.0410157 -0.4596178 0.1000161 0.0170017 0.3956458 -0.3362926 -0.0604388 0.0240359 -0.0080681 -0.1872729 1.9912479 -0.1771586 -0.1864731 -0.1947987 0.8069868 -0.0020021 -0.2318834 -0.0264851 0.2711718 -0.0677643 0.0064214 0.058542 0.0378144 0.064225 0.0033356 0.0540012 -0.0042951 -0.0240838 -0.055376 0.0242626 -0.0091355 0.0233848 0.0626352 -0.0332924 0.0677397 -0.0972799 -0.1287209 0.0436813 0.0123276 0.0132211 0.1025389 -0.0734516 0.0621789 -0.0307875 0.0979216 0.0459469 -0.0042309 0.1083694 -0.0452747 0.1664127 -0.0532674 0.0455051 -0.0785266 0.0217064 0.0408607 0.0569076 -0.0751766 -0.0396128 -0.1212928 -0.0357397 -0.0523956 -0.0170997 -0.0091843 0.073156 -0.0292473 -0.0143166 0.1230932 -0.0124821 0.0917561 0.017204 0.0769045 0.0141675 0.0247114 0.0666715 0.077874 0.0091826 0.0135392 -0.0459588 0.0079948 0.0030635 0.0020332 0.1598801 0.0382033 -0.0718411 0.0252482 -0.0668986 0.0112914 0.0203783 0.0235924 0.0313507 0.1675183 unknown
polarizability: 159.635949|-3.9073286|101.7425661|-7.4150627|-3.981405|61.428043 unknown
InChI: InChI=1S/C7H8N2OS/c1-5-4-9-3-2-6(10)8-7(9)11-5/h2-3,5H,4H2,1H3
charge 0 multiplicity 1
19 atoms
S  1.552103 1.642682 -0.578787
O  -3.444197 0.746008 0.258422
N  0.360397 -0.725107 -0.220471
N  -1.145417 1.158867 -0.089871
C  2.645506 0.107396 -0.202115
C  1.745141 -1.092174 -0.587168
C  0.042522 0.645179 -0.255563
C  3.091443 0.103639 1.266722
C  -0.683122 -1.624081 0.003492
C  -1.964656 -1.163248 0.187405
C  -2.278477 0.2828 0.126943
H  3.504756 0.17157 -0.88842
H  1.801592 -1.290606 -1.674959
H  2.050969 -2.000998 -0.038885
H  3.758067 -0.758373 1.463949
H  3.644159 1.025714 1.512543
H  2.22349 0.039256 1.946544
H  -0.415921 -2.684494 0.026021
H  -2.785855 -1.858829 0.373301
