program: Gaussian 09
title: 000027212
version: EM64L-G09RevD.01
frameworkgroup: C1[X(C17H20O3)]
method: RPBEPBE
basis: SDD
operation: Freq
keyword: #pfreq=noraman
keyword: PBEPBE/SDD
title: #p freq=noraman PBEPBE/SDD
converged: YES YES NO NO
title: Mulliken charges:
elementType: O O O C C C C C C C C C C C C C C C C C H H H H H H H H H H H H H H H H H H H H
charge: -0.193145 -0.209660 -0.436261 -0.232917 -0.070927 0.182730 -0.219125 -0.470601 -0.504092 -0.495872 -0.390834 0.323037 0.151915 -0.761001 -0.575035 0.325393 -0.396035 -0.539170 -0.425472 0.284778 0.236594 0.202625 0.209837 0.233856 0.217589 0.228280 0.227170 0.207443 0.220866 0.222900 0.238003 0.216254 0.251588 0.217850 0.225553 0.228968 0.234597 0.257683 0.220653 0.353985
chargesum: 0.00000
title: Mulliken charges with hydrogens summed into heavy atoms:
elementType: O O O C C C C C C C C C C C C C C C C C
charge: -0.193145 -0.209660 -0.082276 0.003677 0.131698 0.182730 -0.009288 -0.019156 -0.048641 -0.067562 0.070069 0.323037 0.151915 -0.075309 -0.120514 0.325393 -0.161439 -0.281487 -0.204819 0.284778
polarizability: 2.45505721e+02 -2.87189687e+00 1.69003909e+02 3.32154749e+00 -1.54655414e+00 1.33008859e+02
1716.lowfreq: -10.4686 -8.5099 0.0004 0.0007 0.0008 3.9431 44.4488 67.9940 73.4323
frequency: 44.3499 67.9826 73.3765 128.9244 146.8914 164.2476 194.2358 199.6714 214.8632 220.0183 238.3664 259.2563 278.6131 290.2040 331.9348 342.6619 366.6427 390.3630 406.0122 417.3848 446.5878 463.9861 498.7634 528.3689 558.9296 568.2410 589.6917 604.2627 636.0688 666.5824 680.9981 695.2950 715.9758 719.9665 784.5858 805.1731 816.0411 837.3213 857.0087 882.7480 887.6362 904.6105 927.7978 930.6655 948.1750 966.2209 975.4902 1006.8769 1018.6107 1020.0074 1032.6802 1051.6587 1058.0581 1071.0947 1109.6970 1124.4348 1126.3930 1142.5012 1147.5187 1159.3388 1174.5318 1180.9061 1194.0550 1203.7828 1217.4089 1227.7736 1239.6695 1257.3654 1268.6388 1280.0177 1287.1324 1304.3364 1317.4882 1326.1569 1329.1446 1335.3272 1340.3054 1345.1401 1362.4333 1373.0595 1391.2321 1393.5706 1447.0797 1457.9035 1465.5962 1469.3957 1472.7745 1476.2186 1484.4214 1487.7249 1494.7064 1590.0897 1631.6219 1696.8284 2934.1235 2950.3917 2959.3851 2973.4247 2975.4809 2985.4859 2988.9652 2994.8714 3013.9598 3025.1702 3042.9314 3046.2909 3051.5982 3081.1831 3089.4130 3097.2791 3106.8678 3130.3233 3145.2989 3583.7359
redmass: 5.6027 4.0383 5.8583 5.8575 4.6435 3.0735 1.3210 2.5183 3.0533 2.6865 4.0988 2.5924 2.5519 3.7646 3.5070 1.1209 2.3910 4.4042 3.6677 3.1141 2.8603 3.9484 3.7551 4.5709 3.2904 3.4971 4.2155 3.6991 3.4224 4.2841 4.2968 6.4977 3.2574 4.7491 1.9258 1.7855 2.5941 2.3842 1.8309 1.9850 2.0649 2.1203 1.6069 2.3360 6.6212 2.3312 1.8696 2.0295 1.9736 2.2562 2.3756 2.3574 2.2012 2.0261 1.9172 1.9124 1.8100 1.9276 1.3285 1.4385 1.5951 1.5308 1.6699 1.8647 1.9507 1.5452 1.6924 1.5285 2.3531 1.4349 1.2468 1.3609 1.3630 1.4354 1.4693 1.3530 1.4551 1.4828 1.5158 1.5582 4.8302 1.2157 2.7803 1.1890 1.0790 1.0879 1.0562 1.0709 1.0880 1.0822 2.7124 7.1534 6.4993 12.2965 1.0815 1.0834 1.0653 1.0695 1.0786 1.0386 1.0597 1.0605 1.0618 1.0940 1.0977 1.1013 1.1020 1.0992 1.0997 1.1048 1.0866 1.0967 1.0920 1.0660
irintensity: 0.7422 1.0824 4.0204 1.1629 2.0691 1.9028 0.9578 3.6001 1.2407 1.8298 1.3802 2.7960 0.7138 6.2322 5.1037 139.6020 0.7386 2.3734 6.5309 1.9746 3.2328 2.6883 2.1624 1.1426 6.6449 1.5581 5.7680 5.2711 2.4709 1.8407 0.6366 3.6573 2.4510 0.9752 20.1578 23.9085 3.6512 4.4863 26.4373 5.6620 12.3808 38.5286 3.0714 11.8930 69.3322 6.1724 2.5441 57.7130 9.1216 73.2066 2.8551 16.4727 10.1059 11.9498 18.4997 74.4428 11.9962 6.0819 77.6663 32.1223 31.3077 13.4296 4.6925 7.7152 5.6509 1.3493 16.5510 0.9614 49.7281 6.4212 0.7418 0.9874 0.9323 1.0822 2.6110 2.8798 1.8046 2.6042 0.7458 1.4976 17.5364 22.9660 6.6984 5.5914 1.3009 10.3033 14.7338 5.8826 7.4447 15.3212 96.6653 24.3283 58.6807 318.9372 21.1603 33.1501 26.4275 30.5282 14.2054 8.1931 48.6291 23.4259 41.5585 32.1404 44.9570 13.9994 47.5905 28.4066 19.1867 26.1299 17.8065 21.0785 5.5324 41.0136
temp: 298.150 k
press: 1.00000 atm
elementType: 8 8 8 6 6 6 6 6 6 6 6 6 6 6 6 6 6 6 6 6 1 1 1 1 1 1 1 1 1 1 1 1 1 1 1 1 1 1 1 1
symmnumber: 1
zpe: 875918.1 jmol-1
zpe.correction: 0.333620 hartree
zpe.thermalcorrener: 0.350682 hartree
zpe.thermalcorrenthalpy: 0.351626 hartree
zpe.thermalcorrgfe: 0.290099 hartree
zpe.sumelectzpe: -884.016248 hartree
zpe.sumelectthermal: -883.999185 hartree
zpe.sumelectthermalent: -883.998241 hartree
zpe.sumelectthermalfe: -884.059768 hartree
dipole: 4.8422 0.2658 0.4359
dipole: 4.8690
quadrupole: -153.6220 -108.1866 -118.8161
quadrupole: -18.4167 1.4768 0.0807
quadrupole: -26.7471 18.6883 8.0588 -18.4167 1.4768 0.0807
hfenergy: -884.3498673 hartree
pointgroup: C01 [X(C17H20O3)]
dipole: 1.9044118 0.1113393 0.174319 debye
polarizability: 245.4763644|-2.7319368|168.8104394|3.8738573|-3.0699378|133.2316851 unknown
InChI: InChI=1S/C17H20O3/c1-17-7-6-13-12-5-3-11(18)8-10(12)2-4-14(13)15(17)9-20-16(17)19/h3,5,8,13-15,18H,2,4,6-7,9H2,1H3
charge 0 multiplicity 1
40 atoms
O  -4.03227 -0.2165 1.453799
O  -5.117364 -0.790515 -0.516715
O  5.919587 -0.207709 -0.132409
C  -2.051094 0.833859 0.531122
C  -0.499751 0.894735 0.566946
C  -2.718995 -0.040056 -0.579805
C  0.1649 -0.491835 0.324811
C  -1.955656 -1.396217 -0.772495
C  -0.436604 -1.186665 -0.931684
C  0.084639 1.946382 -0.410119
C  -2.667142 0.257517 1.83048
C  1.689607 -0.389293 0.230615
C  -4.08906 -0.386662 0.048321
C  -2.93209 0.674133 -1.930655
C  1.588734 2.153657 -0.14216
C  2.359409 0.84125 -0.029762
C  2.467993 -1.564163 0.380521
C  3.76889 0.860885 -0.147217
C  3.872564 -1.549507 0.270912
C  4.522022 -0.320982 -0.000356
H  -2.432909 1.868804 0.412078
H  -0.213472 1.22935 1.5896
H  -0.07443 -1.150028 1.188313
H  -2.378787 -1.91421 -1.65285
H  -2.131234 -2.06033 0.098533
H  0.057071 -2.165653 -1.078886
H  -0.213019 -0.59098 -1.83727
H  -0.449912 2.908514 -0.289735
H  -0.068251 1.625714 -1.457914
H  -2.104651 -0.609552 2.223222
H  -2.799169 1.005422 2.62779
H  -1.984759 0.780838 -2.48668
H  -3.638126 0.093646 -2.550445
H  -3.360152 1.682804 -1.786699
H  1.710593 2.716855 0.807018
H  2.038145 2.784427 -0.932478
H  1.963163 -2.514764 0.594757
H  4.299674 1.797367 -0.350372
H  4.450162 -2.474486 0.396038
H  6.355044 -1.088253 -0.016069
