program: Gaussian 09
title: 000295846
version: EM64L-G09RevD.01
frameworkgroup: C1[X(C15H16N2OS)]
method: RPBEPBE
basis: SDD
operation: Freq
keyword: #p
keyword: freq=noraman
keyword: PBEPBE/SDD
title: #p freq=noraman PBEPBE/SDD
converged: YES YES NO NO
title: Mulliken charges:
elementType: S O N N C C C C C C C C C C C C C C C H H H H H H H H H H H H H H H H
charge: 0.228713 -0.253411 -0.348751 0.028257 -0.660440 0.278159 0.532351 0.105390 -0.782736 0.470158 -0.207342 -0.407260 -0.813544 -0.375841 -0.372384 -0.219805 -0.219870 -0.706519 -0.233065 0.249496 0.201124 0.298651 0.298052 0.253946 0.342739 0.218772 0.235455 0.231603 0.238929 0.239344 0.230405 0.230343 0.240116 0.216383 0.232580
chargesum: 0.00000
title: Mulliken charges with hydrogens summed into heavy atoms:
elementType: S O N N C C C C C C C C C C C C C C C
charge: 0.228713 -0.253411 -0.006013 0.028257 -0.209820 0.278159 0.532351 0.105390 -0.186034 0.470158 -0.207342 -0.153313 -0.127714 -0.136912 -0.133039 0.010600 0.010473 -0.250020 -0.000485
polarizability: 3.35005719e+02 9.71247252e+00 1.53159770e+02 3.08619120e+00 2.33457855e+00 1.43237326e+02
1716.lowfreq: -12.6681 -2.9047 -0.0007 0.0017 0.0024 4.7881 11.8630 22.8647 33.6866
frequency: 11.2841 21.1014 33.5053 38.9985 49.9601 61.8483 63.5090 110.6315 136.8565 161.7090 186.6097 200.9906 235.8107 278.2797 320.1748 329.9145 366.2211 385.3521 401.9745 402.8054 425.1407 468.6240 481.1089 531.8476 542.4223 556.1505 616.7841 631.1156 642.8965 650.2160 698.3355 702.5962 720.5855 759.3455 776.4668 786.1545 809.9258 819.2046 852.9688 886.2441 889.8323 928.6229 929.1286 932.7449 948.1845 971.1617 978.9495 989.9955 998.8213 1014.6977 1026.5854 1047.6633 1067.8030 1074.8156 1117.4594 1122.1065 1167.6819 1174.2557 1188.7585 1217.0605 1218.6071 1245.7008 1255.9912 1282.1594 1294.4460 1325.6839 1363.1003 1384.8638 1390.7928 1411.3803 1427.2006 1440.8552 1444.4431 1450.1213 1463.7703 1477.1040 1484.0912 1500.6974 1554.3816 1593.5641 1613.7759 1636.0144 1671.0509 2961.1873 2988.9968 3033.4435 3058.7510 3066.0406 3086.3191 3092.7827 3123.7447 3125.2390 3135.0053 3136.8173 3138.0991 3150.3780 3166.6450 3200.3807 3488.1323
redmass: 5.0693 3.5083 3.3433 4.3739 5.0622 6.3746 4.5933 5.8809 5.5715 7.0634 1.0995 4.6331 4.2454 7.2089 2.3035 5.0359 4.0613 2.3497 2.7780 2.7959 2.6051 4.3553 4.5753 3.5235 6.9546 6.3346 6.3344 5.4480 4.8904 2.9138 2.2456 1.6599 1.7977 1.9684 2.1725 3.6114 3.8897 3.4718 1.2506 1.5304 2.6998 1.4999 1.8717 1.7570 1.3398 1.6888 1.3917 6.2209 1.3228 1.5420 2.2003 1.5247 4.9986 1.4784 3.6081 1.0865 1.3735 1.0527 1.1136 3.2793 2.0483 1.4911 2.2451 2.6661 1.3659 1.2792 1.7909 8.8459 1.2258 2.5449 1.1853 2.2029 1.1172 1.0956 1.0505 1.0651 2.3517 4.9564 5.9354 6.0972 6.1173 7.0527 5.0623 1.0377 1.0619 1.0966 1.0581 1.0993 1.0976 1.0631 1.0856 1.0887 1.0925 1.1085 1.0919 1.0964 1.1017 1.1142 1.0777
irintensity: 0.0212 0.0444 0.0706 0.4101 0.2591 0.0353 0.1625 1.2623 0.2962 10.5206 0.5839 1.2734 2.1795 0.8321 0.8756 4.1502 3.3217 3.2610 3.2171 3.1831 13.0804 1.2158 3.7432 39.1629 15.0746 23.6028 0.1301 5.7121 43.0297 5.1798 7.1960 58.8869 22.2175 52.8718 26.0380 15.7223 12.3701 11.5369 0.0080 0.9340 6.7693 7.1631 10.2393 23.6371 81.2128 0.9280 0.0061 0.9446 0.0636 16.0359 6.6455 3.6334 3.0530 9.2729 78.3818 1.3378 27.6594 0.0170 2.8640 108.6186 17.8015 31.2871 23.7036 36.1525 2.1170 0.2600 0.3829 0.2873 24.8504 8.6948 2.6688 9.0393 8.9277 16.6651 18.7066 26.9763 18.1710 690.2343 1.7776 1.0050 1.2785 424.7750 42.1801 25.1263 35.6986 32.9248 4.2037 6.1506 31.1835 9.3367 6.5536 1.1145 32.2654 1.6971 13.1126 36.4423 24.6567 18.9299 32.9381
temp: 298.150 k
press: 1.00000 atm
elementType: 16 8 7 7 6 6 6 6 6 6 6 6 6 6 6 6 6 6 6 1 1 1 1 1 1 1 1 1 1 1 1 1 1 1 1
symmnumber: 1
zpe: 722686.5 jmol-1
zpe.correction: 0.275257 hartree
zpe.thermalcorrener: 0.293869 hartree
zpe.thermalcorrenthalpy: 0.294814 hartree
zpe.thermalcorrgfe: 0.224074 hartree
zpe.sumelectzpe: -1162.607164 hartree
zpe.sumelectthermal: -1162.588551 hartree
zpe.sumelectthermalent: -1162.587607 hartree
zpe.sumelectthermalfe: -1162.658347 hartree
dipole: 3.4936 2.1809 0.7792
dipole: 4.1915
quadrupole: -114.7247 -121.7189 -115.7004
quadrupole: -10.9082 -4.2611 -4.0427
quadrupole: 2.6566 -4.3376 1.6809 -10.9082 -4.2611 -4.0427
hfenergy: -1162.8824207 hartree
pointgroup: C01 [X(C15H16N2O1S1)]
dipole: 1.3965802 0.853392 0.201778 debye
polarizability: 335.3985741|5.5848033|153.1773198|1.1170871|1.0937382|142.8269211 unknown
InChI: InChI=1S/C15H16N2OS/c1-11(2)8-13-9-16-15(17-14(13)18)19-10-12-6-4-3-5-7-12/h3-7,9,17H,1,8,10H2,2H3
charge 0 multiplicity 1
35 atoms
S  1.346185 -1.016036 -0.379174
O  -3.569256 -2.186824 -0.2900
N  -1.339766 -1.479515 -0.252167
N  -0.630255 0.595765 0.671431
C  -4.483908 0.345074 0.933754
C  -3.031104 0.010071 0.652815
C  -5.183086 0.964983 -0.286657
C  -2.739983 -1.280113 0.013502
C  2.275905 0.527553 0.304645
C  3.753072 0.356789 0.057413
C  -0.357968 -0.557103 0.070068
C  -1.970745 0.854343 0.958239
C  -4.857215 2.418722 -0.576209
C  4.345713 0.847044 -1.135352
C  4.574797 -0.29181 1.015954
C  5.731395 0.697008 -1.363614
C  5.960512 -0.443022 0.789568
C  -6.031115 0.233649 -1.055845
C  6.542486 0.051139 -0.401391
H  -5.007488 -0.584143 1.218705
H  -4.537832 1.049024 1.787521
H  2.010367 0.581674 1.370519
H  1.838876 1.39113 -0.217313
H  -2.151199 1.809454 1.464344
H  -1.101547 -2.372353 -0.699785
H  -5.159025 3.070064 0.268423
H  -3.768285 2.5628 -0.719851
H  -5.370646 2.776016 -1.48501
H  3.718455 1.347521 -1.88284
H  4.125208 -0.676521 1.939319
H  6.177544 1.08331 -2.286652
H  6.584725 -0.94224 1.538836
H  -6.228198 -0.822042 -0.840376
H  -6.528496 0.667198 -1.93196
H  7.61778 -0.064509 -0.57706
