program: Gaussian 09
title: 000295830
version: EM64L-G09RevD.01
frameworkgroup: C1[X(C11H14N2O4S)]
method: RPBEPBE
basis: SDD
operation: Freq
keyword: #p
keyword: freq=noraman
keyword: PBEPBE/SDD
title: #p freq=noraman PBEPBE/SDD
converged: YES YES NO NO
title: Mulliken charges:
elementType: S O O O O N N C C C C C C C C C C C H H H H H H H H H H H H H H
charge: 0.304188 -0.286683 -0.243735 -0.245894 -0.212448 0.040939 0.064211 0.087583 0.094709 0.204315 -0.341266 0.181082 -0.257596 -0.251522 -0.429278 -0.663759 -0.661182 -0.824874 0.291100 0.236711 0.227025 0.226889 0.241036 0.221045 0.229425 0.253723 0.217996 0.252539 0.228283 0.287217 0.282790 0.245433
chargesum: 0.00000
title: Mulliken charges with hydrogens summed into heavy atoms:
elementType: S O O O O N N C C C C C C C C C C C
charge: 0.304188 -0.286683 -0.243735 -0.245894 -0.212448 0.040939 0.064211 0.087583 0.094709 0.204315 -0.050166 0.181082 0.206140 0.216403 -0.429278 0.040434 0.037636 -0.009435
polarizability: 2.53135379e+02 -7.01619717e+00 1.79594073e+02 5.68704736e+00 6.60652054e+00 1.02134334e+02
1716.lowfreq: -18.2933 -11.4205 -4.5121 -0.0011 -0.0007 0.0006 4.3180 31.1441 35.5378
frequency: -16.9705 30.6829 35.5226 45.8860 68.3243 76.6823 87.7838 101.6844 106.9324 117.5481 122.8064 137.8604 190.7620 204.3969 210.8839 239.7391 262.4766 288.2131 300.5720 316.0901 328.6444 358.8858 405.7515 427.7374 443.7627 495.6688 511.5027 644.4560 652.5140 665.5435 693.9140 708.4259 729.0236 745.9566 778.0301 804.6288 815.4714 825.1878 831.8248 862.3739 962.2412 980.7888 985.0160 996.4533 1005.3903 1027.1522 1094.5805 1094.9634 1101.5289 1152.9821 1155.4846 1158.5537 1196.3802 1254.1679 1267.3002 1271.8580 1277.6557 1298.3555 1348.9288 1352.8159 1356.5209 1388.1390 1388.8305 1390.0508 1436.1040 1449.0909 1456.9332 1458.7119 1461.9141 1462.1054 1483.9800 1484.8015 1487.6343 1530.7183 1613.2062 1638.0228 2993.8833 2994.6365 3027.2783 3032.7695 3035.6863 3089.0535 3089.9907 3096.5285 3097.0077 3122.3689 3123.7565 3152.5829 3161.2928 3175.3300
redmass: 3.8818 3.3208 4.0301 3.1031 3.7619 4.3167 4.7402 2.8512 3.4935 6.6861 1.3161 4.3637 2.3616 1.3885 1.7413 4.1528 4.1392 2.9565 6.8196 3.6614 7.1697 8.0841 4.0680 3.5013 3.9927 5.7530 9.0533 7.7754 9.1401 7.6927 6.5441 11.3126 5.4961 3.0610 3.8107 1.7039 1.4289 3.2791 4.8934 4.6679 1.4658 1.1825 3.2823 1.3321 2.4642 5.2651 2.2293 2.3283 4.7818 4.6674 1.7036 1.8894 8.6509 8.9260 1.9190 1.1563 1.1517 5.7553 1.2070 1.2504 1.3607 2.1019 1.4300 1.2292 1.0518 1.0572 1.1025 1.0903 1.0492 1.0654 1.0661 1.3250 3.0891 6.5995 10.2135 10.8609 1.0361 1.0361 1.0283 1.0595 1.0595 1.0972 1.0973 1.1032 1.1030 1.1063 1.1069 1.1043 1.1057 1.0934
irintensity: 0.6246 0.8967 2.2896 0.2053 0.1133 0.4320 0.2928 1.1950 3.1401 1.0469 0.6184 2.6034 1.9425 1.9946 1.1809 1.2886 2.9620 9.9356 3.0973 14.1287 21.8034 2.7412 8.9773 9.3980 5.4395 15.5926 16.7525 8.1973 3.4714 10.8948 14.8608 4.8984 3.0462 9.3352 10.2600 6.0042 1.8097 6.2892 2.5153 16.2213 7.3110 7.6239 17.7600 10.0434 32.9948 225.9006 90.9551 61.0265 165.4184 511.0330 2.3324 70.9949 114.5790 67.7265 242.2285 22.7966 13.0781 87.3848 6.6751 14.4222 5.8204 86.4702 18.0703 24.3019 15.9866 29.0538 15.3154 19.2076 13.7087 9.0112 11.2902 32.3528 51.1744 400.9481 239.0356 145.2577 20.0083 18.8467 18.1667 31.9130 22.8864 31.2980 38.4199 0.6990 1.5171 28.8764 27.7201 9.5576 8.1609 1.5689
temp: 298.150 k
press: 1.00000 atm
elementType: 16 8 8 8 8 7 7 6 6 6 6 6 6 6 6 6 6 6 1 1 1 1 1 1 1 1 1 1 1 1 1 1
symmnumber: 1
zpe: 630047.3 jmol-1
zpe.correction: 0.239972 hartree
zpe.thermalcorrener: 0.258985 hartree
zpe.thermalcorrenthalpy: 0.259929 hartree
zpe.thermalcorrgfe: 0.190631 hartree
zpe.sumelectzpe: -1234.665781 hartree
zpe.sumelectthermal: -1234.646768 hartree
zpe.sumelectthermalent: -1234.645824 hartree
zpe.sumelectthermalfe: -1234.715122 hartree
dipole: -1.5973 1.2361 -1.4682
dipole: 2.4970
quadrupole: -88.6304 -109.0499 -117.3870
quadrupole: 12.3345 3.3781 -6.1750
quadrupole: 16.3920 -4.0275 -12.3645 12.3345 3.3781 -6.1750
hfenergy: -1234.9057532 hartree
pointgroup: C01 [X(C11H14N2O4S1)]
dipole: -0.4631794 -0.5897188 0.6346738 debye
polarizability: 243.5566471|24.7889428|189.1671772|-10.7365823|-2.9359691|102.139962 unknown
InChI: InChI=1S/C11H14N2O4S/c1-4-16-9(14)7-6-12-11(18-3)13-8(7)10(15)17-5-2/h6H,4-5H2,1-3H3
charge 0 multiplicity 1
32 atoms
S  3.296137 2.987728 -0.610627
O  -2.929758 0.756546 0.058216
O  0.898801 -2.146687 0.531955
O  -1.957789 -1.343622 -0.276184
O  0.796268 -2.065032 -1.806302
N  1.838571 0.665032 -0.592101
N  0.646619 2.773279 -0.271764
C  -0.575051 0.657577 -0.277199
C  0.661666 -0.012735 -0.490002
C  -1.850812 -0.0956 -0.173635
C  -0.512711 2.076848 -0.173603
C  0.767759 -1.512866 -0.686358
C  -4.279393 0.11267 0.148636
C  0.985105 -3.644231 0.498042
C  1.778129 2.024569 -0.480371
C  -4.889437 -0.062754 -1.244268
C  2.431688 -4.095455 0.284379
C  4.55574 1.619239 -0.900006
H  -1.424861 2.655427 -0.006813
H  -4.168732 -0.856114 0.666231
H  -4.855393 0.815724 0.770814
H  0.594101 -3.941633 1.483584
H  0.318502 -4.007893 -0.302832
H  -5.91815 -0.457333 -1.149917
H  -4.938444 0.901528 -1.778501
H  -4.301722 -0.776793 -1.844765
H  2.489548 -5.19781 0.352029
H  2.79554 -3.791251 -0.710988
H  3.095644 -3.667616 1.055077
H  4.297474 1.065361 -1.812666
H  4.566458 0.936704 -0.039438
H  5.522705 2.134193 -1.009319
