program: Gaussian 09
title: 000295828
version: EM64L-G09RevD.01
frameworkgroup: C1[X(C11H15N3O2)]
method: RPBEPBE
basis: SDD
operation: Freq
keyword: #p
keyword: freq=noraman
keyword: PBEPBE/SDD
title: #p freq=noraman PBEPBE/SDD
converged: YES YES NO NO
title: Mulliken charges:
elementType: O O N N N C C C C C C C C C C C H H H H H H H H H H H H H H H
charge: -0.281122 -0.312553 -0.366065 -0.100100 -0.028769 0.179511 0.048369 -0.445602 -0.359349 0.022427 0.227634 -0.221340 -0.744197 -0.029497 -0.672227 -0.575917 0.363906 0.266923 0.219272 0.277458 0.230297 0.230346 0.240370 0.240747 0.240740 0.236264 0.213442 0.231744 0.231734 0.219533 0.216020
chargesum: 0.00000
title: Mulliken charges with hydrogens summed into heavy atoms:
elementType: O O N N N C C C C C C C C C C C
charge: -0.281122 -0.312553 -0.002159 -0.100100 -0.028769 0.179511 0.048369 0.040594 -0.081892 0.022427 0.227634 0.239303 -0.022340 0.206767 0.004693 -0.140364
polarizability: 1.95400093e+02 8.55558671e+00 1.97202426e+02 4.45355671e+00 6.35448287e+00 8.76644865e+01
1716.lowfreq: -4.9358 -0.0010 -0.0005 -0.0004 3.7914 6.8241 32.7755 39.9190 56.3286
frequency: 32.7334 39.8411 56.2939 67.6033 71.7508 87.1496 99.0865 113.7803 122.7586 183.3222 198.8978 230.1185 246.0882 289.3867 292.1962 327.2367 347.1407 375.7836 386.8190 435.4843 460.6912 548.1911 592.0783 627.5043 634.5962 655.5001 705.0530 739.4123 785.3849 789.6877 799.5089 826.6439 835.3878 894.9989 922.9488 951.5526 954.5361 972.1360 1004.4299 1010.0061 1032.2660 1045.9673 1051.3147 1088.2116 1112.9538 1135.5460 1142.5662 1189.5356 1249.0693 1249.2304 1267.3224 1282.9360 1284.5960 1296.7005 1332.1202 1362.9836 1385.6758 1401.9143 1410.5547 1417.5956 1426.9600 1432.6293 1453.5138 1464.0585 1464.4697 1473.4599 1474.7286 1486.7792 1536.9033 1583.7248 1594.8836 1658.1665 2990.4106 2996.7848 2997.3914 3011.8561 3058.6096 3070.7785 3078.2516 3087.4994 3093.4845 3106.6657 3109.2277 3132.8021 3156.8285 3198.8660 3362.1521
redmass: 3.5734 3.2617 3.3235 1.2684 1.8748 3.4566 3.5968 3.9520 2.6802 3.2992 4.4177 4.2217 1.2691 4.4419 4.9408 3.7917 2.9750 5.2195 3.1280 3.2002 2.4531 3.8775 4.5838 4.5024 5.3778 2.0422 7.5474 4.7292 3.2474 6.6759 1.1068 1.3486 4.1777 1.7965 2.3937 1.3348 1.4833 1.7603 1.5022 1.9380 3.3146 2.7257 1.6425 4.8625 2.2196 1.4588 2.0500 3.6916 1.1482 1.6774 2.3852 1.2291 1.6562 5.0788 1.2675 1.4582 1.2906 1.2750 2.0580 3.2269 1.3468 2.2900 1.0473 1.0400 1.1777 1.1169 1.3480 1.0754 6.4274 3.1770 5.4032 4.5858 1.0613 1.0359 1.0376 1.0581 1.0996 1.1067 1.0963 1.0603 1.0985 1.0949 1.1027 1.1001 1.0928 1.1142 1.0801
irintensity: 0.2075 0.5336 0.5414 1.5408 0.3030 0.5145 0.3322 0.4935 1.2611 1.8124 1.0557 5.8791 0.3690 10.8384 5.6722 7.1321 5.1033 18.5257 2.0867 1.7470 14.0417 0.2716 3.1193 0.6974 0.2563 32.7584 0.3428 5.1452 0.5255 2.2794 4.9691 115.3309 1.0792 39.0683 11.1956 64.2923 3.6263 31.3377 3.0049 19.8090 191.6668 2.6143 11.3522 212.1126 2.1973 5.6857 10.7074 313.7385 1.4982 42.4460 62.2872 1.2710 236.7528 8.2595 11.5684 11.3222 8.7954 35.9216 105.5033 212.1182 13.4761 33.6223 13.5828 12.3091 16.4509 5.7265 3.3448 8.5474 96.9592 507.0820 416.7131 30.0934 53.3896 21.0174 5.3659 18.9863 8.6641 7.6652 10.8926 12.8994 28.6596 9.4088 43.1332 13.8786 3.2754 25.0054 132.2009
temp: 298.150 k
press: 1.00000 atm
elementType: 8 8 7 7 7 6 6 6 6 6 6 6 6 6 6 6 1 1 1 1 1 1 1 1 1 1 1 1 1 1 1
symmnumber: 1
zpe: 651693.6 jmol-1
zpe.correction: 0.248217 hartree
zpe.thermalcorrener: 0.265102 hartree
zpe.thermalcorrenthalpy: 0.266046 hartree
zpe.thermalcorrgfe: 0.201760 hartree
zpe.sumelectzpe: -741.672512 hartree
zpe.sumelectthermal: -741.655627 hartree
zpe.sumelectthermalent: -741.654683 hartree
zpe.sumelectthermalfe: -741.718968 hartree
dipole: 0.9136 -1.8153 -0.1194
dipole: 2.0358
quadrupole: -79.5280 -98.6040 -92.8895
quadrupole: -3.0053 0.6539 -0.3441
quadrupole: 10.8125 -8.2635 -2.5490 -3.0053 0.6539 -0.3441
hfenergy: -741.9207288 hartree
pointgroup: C01 [X(C11H15N3O2)]
dipole: -0.3205277 0.7300276 -0.0763026 debye
polarizability: 196.4475289|8.6354445|195.8211321|-2.8987809|-9.3454518|87.998344 unknown
InChI: InChI=1S/C11H15N3O2/c1-4-6-12-10-9(11(15)16-5-2)7-13-8(3)14-10/h4,7,12H,1,5-6H2,2-3H3
charge 0 multiplicity 1
31 atoms
O  -2.893503 0.471507 -0.182601
O  -1.147916 1.982631 -0.49145
N  1.376331 0.95807 -0.532572
N  1.583079 -1.369939 -0.225717
N  -0.368153 -2.79723 0.097549
C  0.778023 -0.25109 -0.324117
C  -0.660893 -0.38205 -0.208284
C  2.833519 1.151399 -0.655853
C  -1.155921 -1.693005 0.001788
C  0.992909 -2.574222 -0.024097
C  -1.544206 0.787807 -0.308223
C  -3.849631 1.618954 -0.273596
C  1.879556 -3.787681 0.078537
C  3.368679 2.076458 0.420337
C  -5.249254 1.034064 -0.119212
C  4.070122 3.210516 0.174299
H  0.736338 1.767129 -0.583487
H  3.290371 0.148844 -0.575667
H  3.070021 1.561175 -1.656888
H  -2.23533 -1.847799 0.095324
H  -3.5993 2.341531 0.52392
H  -3.700918 2.117035 -1.248552
H  2.937633 -3.50271 -0.014081
H  1.711028 -4.298488 1.043456
H  1.617938 -4.513747 -0.712265
H  3.162545 1.76737 1.45547
H  -5.998937 1.84416 -0.17661
H  -5.463626 0.305422 -0.919453
H  -5.360423 0.52678 0.85423
H  4.457139 3.834922 0.98682
H  4.282278 3.544087 -0.849706
