program: Gaussian 09
title: 000295826
version: EM64L-G09RevD.01
frameworkgroup: C1[X(C15H18N4S)]
method: RPBEPBE
basis: SDD
operation: Freq
keyword: #p
keyword: freq=noraman
keyword: PBEPBE/SDD
title: #p freq=noraman PBEPBE/SDD
converged: YES YES NO NO
title: Mulliken charges:
elementType: S N N N N C C C C C C C C C C C C C C C H H H H H H H H H H H H H H H H H H
charge: 0.274136 -0.388684 0.042248 -0.029039 0.024676 -0.363593 -0.410116 0.477069 -0.806061 -0.669706 -0.380259 -0.376762 -0.234528 -0.221569 -0.221746 0.254965 -0.384440 -0.236908 -0.303709 -0.282660 0.196632 0.213606 0.223548 0.213029 0.281381 0.281387 0.214185 0.216128 0.222828 0.236923 0.237559 0.207184 0.226585 0.226622 0.228951 0.290894 0.271805 0.247440
chargesum: 0.00000
title: Mulliken charges with hydrogens summed into heavy atoms:
elementType: S N N N N C C C C C C C C C C C C C C C
charge: 0.274136 -0.097789 0.042248 -0.029039 0.024676 0.046645 0.026460 0.477069 -0.243293 -0.016565 -0.143336 -0.139203 -0.027344 0.005016 0.004876 0.254965 -0.384440 -0.007957 -0.031904 -0.035221
polarizability: 3.59655940e+02 -7.03359826e-01 2.00556947e+02 9.30253150e+00 5.55962413e+00 1.46786873e+02
1716.lowfreq: -4.7132 -2.4602 -0.0025 -0.0023 -0.0013 4.8793 13.9128 20.7023 26.9336
frequency: 13.6815 20.6783 26.8940 34.8985 43.0169 69.5462 81.5941 88.1114 112.5507 137.8805 158.3574 213.6032 216.0109 222.6589 245.0687 259.6131 308.8592 324.8548 342.8026 357.9377 401.7992 429.5242 431.1189 467.9548 479.0953 549.1053 560.7402 613.9964 616.7710 626.4449 650.1309 659.3845 702.6515 727.2981 767.5162 772.7204 778.2407 809.4593 832.6325 845.7929 852.8673 878.5205 889.3719 902.6822 917.8188 926.7297 928.7670 970.0942 977.1657 983.6726 989.7871 996.3411 1026.0980 1062.0557 1065.0900 1072.8669 1077.9126 1104.5416 1122.5004 1156.0753 1172.6479 1181.0686 1188.0030 1218.0370 1218.6418 1242.7157 1252.4671 1260.9109 1290.0999 1309.9110 1324.4054 1328.9978 1334.4694 1347.9087 1383.7424 1384.3210 1394.5150 1439.7763 1445.7936 1450.6974 1470.1179 1475.7325 1483.3621 1483.5887 1501.3040 1539.4186 1561.6280 1593.2777 1611.5984 1614.2029 2959.5777 2966.9424 2977.9442 2980.8134 3029.0523 3047.6997 3058.2213 3077.7664 3078.8084 3121.6291 3121.7998 3124.9626 3136.7290 3144.6212 3148.1819 3164.6712 3211.4772 3401.2895
redmass: 4.1107 3.7152 4.5097 4.3150 4.1303 5.0184 3.5431 3.7336 4.4340 2.0656 4.9949 5.6651 1.8067 4.2222 3.3245 3.0857 4.4294 2.2521 2.5873 5.5974 2.8065 3.3619 9.1709 2.4520 3.8991 4.6020 5.7398 1.5496 6.3244 6.3835 2.8459 5.0348 1.6469 6.0287 5.1843 1.2634 2.1877 3.8948 2.0898 1.4244 1.2492 2.3166 1.5247 2.4293 1.5526 1.4860 7.1873 1.3935 1.3900 1.6764 5.8038 1.3381 2.1933 1.6950 1.8284 1.4830 2.6201 3.4287 1.0884 2.2092 1.0522 2.7995 1.1560 1.9531 1.3058 1.6038 1.3362 2.5424 2.8580 1.3935 1.2796 1.7184 1.7444 1.6164 1.9719 8.7454 1.2210 2.2016 1.1123 1.0980 1.0697 1.0440 1.0998 2.2136 2.9619 3.4459 5.9461 6.0970 7.3389 6.1452 1.0826 1.0662 1.0518 1.0477 1.0994 1.0578 1.0969 1.1000 1.0998 1.0855 1.1035 1.0919 1.0921 1.0920 1.0965 1.1017 1.0954 1.0749
irintensity: 0.0226 0.0054 0.0794 0.1879 0.3507 0.5496 0.4499 0.2391 0.5145 1.7564 0.7287 10.2907 3.8257 2.7088 8.3719 5.0844 7.4623 1.0200 7.3660 16.1889 0.0008 4.7078 3.6871 1.2467 9.1065 16.3749 11.9666 56.1879 0.0526 12.1157 20.7631 23.7127 58.7468 47.2448 0.2864 7.1826 28.1654 10.0170 8.4505 43.0870 0.0992 2.8452 0.5813 6.1146 18.4069 1.9413 12.6374 0.1346 0.0171 6.2049 0.5335 0.1178 9.3082 4.0893 31.0227 9.6253 21.6671 275.9935 1.4099 29.0829 0.0337 226.0780 6.5604 0.5769 1.8859 15.3452 8.0829 15.3314 13.2643 37.2870 0.2245 12.7294 159.8798 116.8441 246.9989 0.0880 12.4451 8.2225 15.1631 14.4263 3.1899 16.6756 14.3793 13.9158 12.6327 241.7655 899.1471 1.0198 4.1747 2.6532 44.3425 13.0487 73.5121 16.4332 24.7007 9.5057 17.7799 57.8167 72.6789 6.1416 2.2374 2.9742 17.3796 26.2529 42.1729 26.3762 0.8915 7.7520
temp: 298.150 k
press: 1.00000 atm
elementType: 16 7 7 7 7 6 6 6 6 6 6 6 6 6 6 6 6 6 6 6 1 1 1 1 1 1 1 1 1 1 1 1 1 1 1 1 1 1
symmnumber: 1
zpe: 796458.7 jmol-1
zpe.correction: 0.303355 hartree
zpe.thermalcorrener: 0.323210 hartree
zpe.thermalcorrenthalpy: 0.324155 hartree
zpe.thermalcorrgfe: 0.250358 hartree
zpe.sumelectzpe: -1197.970423 hartree
zpe.sumelectthermal: -1197.950568 hartree
zpe.sumelectthermalent: -1197.949623 hartree
zpe.sumelectthermalfe: -1198.023420 hartree
dipole: -3.8211 -4.5424 -0.9506
dipole: 6.0115
quadrupole: -101.7344 -129.2154 -122.7685
quadrupole: -3.3979 0.7760 -0.8160
quadrupole: 16.1717 -11.3093 -4.8624 -3.3979 0.7760 -0.8160
hfenergy: -1198.273778 hartree
pointgroup: C01 [X(C15H18N4S1)]
dipole: -1.458816 -1.8025331 -0.4652164 debye
polarizability: 359.5481744|2.6473468|199.9329545|9.8579358|8.3533122|147.5186312 unknown
InChI: InChI=1S/C15H18N4S/c1-2-3-10-17-19-14-9-11-16-15(18-14)20-12-13-7-5-4-6-8-13/h4-11,19H,2-3,12H2,1H3
charge 0 multiplicity 1
38 atoms
S  2.204011 1.603891 0.310067
N  -2.482366 -0.158934 -0.47011
N  -3.862145 -0.075677 -0.561864
N  -0.375662 0.741075 -0.097314
N  -0.028386 3.087939 0.468788
C  -6.719836 -2.153886 -0.017483
C  -6.027029 -1.151084 -0.984761
C  3.810805 -0.662295 -0.073525
C  2.356112 -0.261365 -0.114118
C  -6.544352 -1.779841 1.469588
C  4.3931 -1.148555 1.12593
C  4.622273 -0.558754 -1.23337
C  -4.525098 -1.166205 -0.862667
C  5.753035 -1.528552 1.164604
C  5.982571 -0.937585 -1.197688
C  -1.726459 0.962417 -0.154078
C  0.400362 1.81626 0.211265
C  6.552143 -1.424609 0.00207
C  -2.294644 2.242405 0.093411
C  -1.384383 3.270156 0.401661
H  -6.3226 -3.173485 -0.198535
H  -7.797776 -2.190255 -0.267958
H  -6.388928 -0.124497 -0.793217
H  -6.305256 -1.412131 -2.027228
H  1.903722 -0.389081 -1.109206
H  1.743061 -0.797551 0.625932
H  -6.968079 -0.779741 1.677403
H  -7.054534 -2.508343 2.125648
H  -5.476898 -1.752955 1.755436
H  3.777046 -1.225335 2.029995
H  4.184194 -0.177292 -2.163639
H  -4.016036 -2.138947 -1.032899
H  6.188473 -1.904027 2.097475
H  6.596368 -0.853691 -2.101565
H  7.607185 -1.719373 0.030944
H  -1.964381 -1.035817 -0.631648
H  -3.371823 2.399046 0.042741
H  -1.736191 4.287078 0.606011
