program: Gaussian 09
title: 000295821
version: EM64L-G09RevD.01
frameworkgroup: C1[X(C12H12N4OS)]
method: RPBEPBE
basis: SDD
operation: Freq
keyword: #p
keyword: freq=noraman
keyword: PBEPBE/SDD
title: #p freq=noraman PBEPBE/SDD
converged: YES YES NO NO
title: Mulliken charges:
elementType: S O N N N N C C C C C C C C C C C C H H H H H H H H H H H H
charge: 0.291922 -0.342936 -0.452445 -0.028430 0.031291 -0.630654 0.191804 0.423817 0.054511 -0.445885 -0.336639 -0.358168 -0.199436 -0.218430 -0.402076 0.219261 -0.257883 -0.835226 0.380382 0.242028 0.303716 0.218057 0.227230 0.222562 0.228686 0.324994 0.345291 0.276788 0.277559 0.248309
chargesum: 0.00000
title: Mulliken charges with hydrogens summed into heavy atoms:
elementType: S O N N N N C C C C C C C C C C C C
charge: 0.291922 -0.342936 -0.072063 -0.028430 0.031291 0.039631 0.191804 0.423817 0.054511 -0.203856 -0.032923 -0.140111 0.027795 0.004132 -0.402076 0.219261 -0.029198 -0.032571
polarizability: 2.80457084e+02 5.71742015e+00 2.53529374e+02 1.05186352e-01 -2.36556940e-01 7.14681042e+01
1716.lowfreq: -8.5191 -8.1887 -0.0011 -0.0007 0.0012 1.3077 9.8121 36.1416 49.8560
frequency: 5.7831 36.1409 49.8525 79.0260 86.1096 103.3176 152.1147 161.9175 185.4610 198.7470 246.7880 258.5172 289.6690 301.3055 332.2727 377.2854 390.7398 410.2469 478.3609 494.7145 505.9476 514.7449 569.8987 576.7334 607.0624 618.6738 649.8022 663.7725 680.7996 697.9950 716.5874 758.2670 768.2659 784.7103 832.0794 845.8298 906.1664 919.7136 938.1587 969.0121 981.2049 983.9401 985.9008 995.3395 998.6166 1024.4183 1034.3503 1053.7524 1085.8676 1170.6568 1180.1169 1186.3333 1206.7923 1248.8692 1304.0286 1322.0600 1342.5978 1367.1903 1372.7486 1395.3375 1411.5796 1436.8881 1439.7005 1453.0038 1457.9284 1489.4677 1522.6490 1570.0327 1583.0317 1612.1668 1620.2202 1659.9552 3019.6171 3067.5078 3109.9517 3122.4902 3130.0266 3143.4829 3144.5448 3148.1456 3165.0379 3212.4912 3536.7283 3687.9627
redmass: 3.9261 3.6233 4.8604 5.5970 6.8691 4.7715 4.1602 1.0552 7.0818 5.0186 6.8517 4.8675 5.4697 5.6213 12.3082 5.4037 2.1637 2.9103 1.4527 5.6669 8.7045 2.9238 1.2496 8.1606 4.3770 5.7058 8.3462 6.9071 7.2887 1.9401 8.4234 7.7188 1.7099 5.8245 5.5449 1.2688 1.5802 1.4042 5.5269 1.2287 1.2158 1.2181 5.9220 1.3666 1.2973 2.3722 3.4711 2.3665 1.5657 1.0610 5.5188 1.1286 4.1281 3.0187 4.8897 1.4522 1.2311 1.8996 4.2168 6.0998 4.8860 2.6324 1.0526 2.3360 1.1955 2.6347 4.8252 5.5331 5.0215 2.5298 1.9999 1.6894 1.0282 1.0837 1.0911 1.0866 1.0884 1.1037 1.0941 1.1059 1.1004 1.0932 1.0453 1.1039
irintensity: 11.9362 0.4053 0.4995 0.0338 1.1935 2.6334 6.4719 0.0182 0.0558 4.7803 2.6164 4.9460 0.0100 7.5245 1.2731 4.7437 6.6523 0.2722 94.6441 15.7149 20.1911 39.2872 135.3906 15.3697 1.2887 3.6647 13.5570 2.6937 1.0153 44.5534 9.4954 13.4554 68.2743 5.8154 3.0922 1.6385 8.5185 0.6641 27.9467 70.8340 10.2405 39.8568 2.4746 3.2811 2.3737 12.7468 0.5644 53.0087 15.8447 0.0167 234.6183 1.6165 20.1550 12.9551 84.8157 17.7048 59.2987 279.3356 44.5838 34.5381 342.2587 76.5079 15.1480 16.9700 11.9188 60.5627 162.5190 946.8298 110.0819 341.5741 306.5783 52.0526 15.2086 299.9637 48.2828 8.7092 2.7184 17.0849 25.4180 11.0095 30.7606 8.5602 85.2880 36.8252
temp: 298.150 k
press: 1.00000 atm
elementType: 16 8 7 7 7 7 6 6 6 6 6 6 6 6 6 6 6 6 1 1 1 1 1 1 1 1 1 1 1 1
symmnumber: 1
zpe: 593032.7 jmol-1
zpe.correction: 0.225874 hartree
zpe.thermalcorrener: 0.242422 hartree
zpe.thermalcorrenthalpy: 0.243366 hartree
zpe.thermalcorrgfe: 0.178737 hartree
zpe.sumelectzpe: -1155.520253 hartree
zpe.sumelectthermal: -1155.503705 hartree
zpe.sumelectthermalent: -1155.502761 hartree
zpe.sumelectthermalfe: -1155.567390 hartree
dipole: -0.2228 -1.6805 -0.0135
dipole: 1.6952
quadrupole: -103.1624 -95.9674 -118.1292
quadrupole: 21.0813 0.0821 -0.0206
quadrupole: 2.5906 9.7856 -12.3761 21.0813 0.0821 -0.0206
hfenergy: -1155.7461271 hartree
pointgroup: C01 [X(C12H12N4O1S1)]
dipole: 0.1199618 0.6555433 -0.0263601 debye
polarizability: 280.9413053|4.3227168|252.8745766|-1.6707327|-5.380413|71.6386802 unknown
InChI: InChI=1S/C12H12N4OS/c1-18-12-14-7-9(10(13)17)11(16-12)15-8-5-3-2-4-6-8/h2-7,15H,13H2,1H3
charge 0 multiplicity 1
30 atoms
S  2.281028 -3.437451 0.1676
O  0.713105 3.198938 -0.027272
N  -0.505488 0.872802 0.052532
N  0.832666 -1.105386 0.103123
N  3.270013 -0.962364 0.083406
N  3.009154 3.314937 -0.056188
C  0.722721 0.267721 0.061539
C  -1.822093 0.343198 0.077126
C  1.925556 1.09472 0.02714
C  -2.875471 1.302291 0.065865
C  -2.141208 -1.041203 0.109389
C  3.153333 0.390276 0.041372
C  -4.220018 0.885691 0.086171
C  -3.494524 -1.442639 0.129187
C  2.073823 -1.638494 0.112111
C  1.843266 2.577234 -0.019591
C  -4.540778 -0.492454 0.117912
C  0.492079 -4.007214 0.198021
H  -0.409481 1.917543 0.022035
H  -2.631814 2.371468 0.040994
H  -1.330577 -1.768712 0.11828
H  4.113395 0.920669 0.019004
H  -5.017494 1.636788 0.07716
H  -3.731165 -2.512738 0.153729
H  -5.586518 -0.817352 0.133523
H  3.939238 2.904932 -0.054782
H  2.914858 4.329334 -0.086859
H  -0.022184 -3.673057 -0.714378
H  -0.012285 -3.607492 1.089308
H  0.535763 -5.106787 0.237645
