program: Gaussian 09
title: 000295820
version: EM64L-G09RevD.01
frameworkgroup: C1[X(C9H13N3O2S)]
method: RPBEPBE
basis: SDD
operation: Freq
keyword: #p
keyword: freq=noraman
keyword: PBEPBE/SDD
title: #p freq=noraman PBEPBE/SDD
converged: YES YES NO NO
title: Mulliken charges:
elementType: S O O N N N C C C C C C C C C H H H H H H H H H H H H H
charge: 0.264208 -0.245032 -0.285479 -0.013158 0.028615 -0.630692 -0.644516 0.293127 0.106065 0.306734 -0.419090 -0.263207 -0.394810 -0.661809 -0.831431 0.254021 0.243712 0.247290 0.231123 0.238482 0.223279 0.246869 0.230985 0.367938 0.319471 0.273790 0.239613 0.273904
chargesum: 0.00000
title: Mulliken charges with hydrogens summed into heavy atoms:
elementType: S O O N N N C C C C C C C C C
charge: 0.264208 -0.245032 -0.285479 -0.013158 0.028615 0.056717 -0.146783 0.293127 0.106065 0.306734 -0.171801 0.206398 -0.394810 0.039324 -0.044125
polarizability: 2.20367549e+02 2.02485164e+00 1.40998177e+02 1.47414111e+01 1.16203022e+00 8.90012557e+01
1716.lowfreq: -7.2135 -3.3688 -0.0022 -0.0022 -0.0017 5.0918 24.2507 38.5765 56.5709
frequency: 24.1377 38.5386 56.4824 68.5123 98.3676 105.1697 121.0474 137.5754 169.2896 203.6964 218.1032 242.0207 282.9723 298.1971 320.1044 370.6174 387.0384 428.7847 447.7625 473.4120 542.0780 570.0446 588.8173 652.9996 667.4840 674.4770 703.4992 721.3453 748.4051 765.4950 804.1699 813.6457 894.5100 899.0708 932.9427 945.2481 978.2729 989.6951 1011.1887 1042.9896 1096.3217 1128.6851 1157.1786 1162.9407 1204.3551 1246.6256 1277.3820 1282.8241 1292.6975 1331.3863 1340.9342 1358.2714 1359.1984 1392.6745 1430.5216 1434.9548 1444.7858 1453.4886 1456.3264 1464.0264 1484.7350 1530.5955 1547.8320 1604.4518 1647.4936 2990.7014 2995.0741 3020.9528 3035.5784 3089.3643 3090.8375 3096.9707 3120.9828 3124.5398 3144.1987 3151.0224 3397.0127 3622.0453
redmass: 4.4168 2.8005 3.9502 6.6072 3.6682 4.3108 1.2092 3.6356 3.4116 5.2104 1.6006 3.2287 5.4641 2.3311 4.5008 3.0602 7.0464 3.1002 3.5669 3.9036 6.7502 3.5024 1.3392 5.3966 7.4242 5.6233 1.2080 6.1635 3.2804 5.4766 3.1234 1.6439 4.1579 3.3093 1.7009 2.0160 1.1796 1.2937 2.8584 2.8780 2.1662 1.7673 1.7189 3.2727 3.3403 1.8151 1.1455 3.0603 2.0318 1.7381 1.4036 1.5730 1.7324 1.2323 3.1385 1.0535 1.1767 1.0967 1.1093 1.0435 1.0518 4.4990 5.8194 6.7074 1.3180 1.0643 1.0360 1.0282 1.0596 1.0969 1.0975 1.1027 1.0926 1.1072 1.1038 1.1055 1.0572 1.0943
irintensity: 1.0524 0.1551 3.6180 0.5449 1.0152 0.6799 0.7606 1.8648 0.2121 1.3797 7.5167 0.3679 2.9975 8.8563 16.7276 4.3116 19.3987 2.7394 11.1670 11.0926 5.3822 23.6122 63.7741 8.5972 2.9057 8.1668 186.4693 7.6626 6.1494 26.8527 9.9541 3.1328 4.7400 24.4828 4.8738 18.9035 8.5008 13.5262 79.3763 132.4827 21.5574 99.0396 7.9523 64.8504 203.2652 135.5328 20.0271 24.9964 30.5302 115.5424 4.6263 55.5867 107.7513 21.3565 144.8602 13.2464 18.4908 7.6312 13.8382 15.3619 13.1173 70.5220 222.5585 376.3161 109.5267 15.4817 19.2620 26.1592 22.3323 4.7780 30.6974 2.5750 22.2179 27.7627 12.7382 13.9170 288.8298 88.3118
temp: 298.150 k
press: 1.00000 atm
elementType: 16 8 8 7 7 7 6 6 6 6 6 6 6 6 6 1 1 1 1 1 1 1 1 1 1 1 1 1
symmnumber: 1
zpe: 570906.9 jmol-1
zpe.correction: 0.217447 hartree
zpe.thermalcorrener: 0.233453 hartree
zpe.thermalcorrenthalpy: 0.234397 hartree
zpe.thermalcorrgfe: 0.172231 hartree
zpe.sumelectzpe: -1062.402197 hartree
zpe.sumelectthermal: -1062.386191 hartree
zpe.sumelectthermalent: -1062.385247 hartree
zpe.sumelectthermalfe: -1062.447413 hartree
dipole: -4.9189 2.3448 -0.0171
dipole: 5.4492
quadrupole: -84.8066 -97.3945 -93.3336
quadrupole: 14.6506 -1.9341 1.3561
quadrupole: 7.0383 -5.5496 -1.4887 14.6506 -1.9341 1.3561
hfenergy: -1062.6196436 hartree
pointgroup: C01 [X(C9H13N3O2S1)]
dipole: -1.8961845 -0.9913596 -0.1338703 debye
polarizability: 216.6355464|8.7670387|135.9280917|-24.9829559|14.7337541|97.8033439 unknown
InChI: InChI=1S/C9H13N3O2S/c1-3-14-7(13)4-6-5-11-9(15-2)12-8(6)10/h5H,3-4,10H2,1-2H3
charge 0 multiplicity 1
28 atoms
S  4.312722 1.082272 -0.744158
O  -3.241715 0.730367 0.144922
O  -2.488824 -1.410613 -0.376319
N  2.110917 -0.537251 -0.461466
N  1.976771 1.739384 0.398015
N  0.317211 -2.035169 -0.312006
C  -1.283537 -0.063279 1.306237
C  0.075594 0.211343 0.676636
C  0.826316 -0.788303 -0.037497
C  -2.380509 -0.339553 0.282593
C  0.71492 1.456509 0.840039
C  -4.351963 0.592931 -0.859295
C  2.614106 0.69838 -0.218055
C  -5.576731 -0.061236 -0.216541
C  4.811887 -0.552123 -1.526469
H  -1.217229 -0.955918 1.959387
H  -1.583277 0.798828 1.923284
H  0.20098 2.273068 1.362413
H  -4.545598 1.632736 -1.165369
H  -3.976329 0.00303 -1.713135
H  -6.413051 -0.069066 -0.939736
H  -5.362482 -1.104304 0.070738
H  -5.900343 0.499296 0.677194
H  -0.697529 -2.196726 -0.28572
H  0.924703 -2.678809 -0.817853
H  4.772425 -1.353892 -0.775974
H  5.84195 -0.402559 -1.887089
H  4.135216 -0.788943 -2.359374
