program: Gaussian 09
title: 000295804
version: EM64L-G09RevD.01
frameworkgroup: C1[X(C8H10N2OS)]
method: RPBEPBE
basis: SDD
operation: Freq
keyword: #p
keyword: freq=noraman
keyword: PBEPBE/SDD
title: #p freq=noraman PBEPBE/SDD
converged: YES YES NO NO
title: Mulliken charges:
elementType: S O N N C C C C C C C C H H H H H H H H H H
charge: 0.236580 -0.255845 -0.345535 0.029283 0.238436 -0.556495 0.097550 -0.382581 -0.219866 -0.039131 -0.589726 -0.805140 0.239982 0.248639 0.267171 0.343775 0.229593 0.289072 0.288203 0.245958 0.217784 0.222291
chargesum: 0.00000
title: Mulliken charges with hydrogens summed into heavy atoms:
elementType: S O N N C C C C C C C C
charge: 0.236580 -0.255845 -0.001760 0.029283 0.238436 -0.067874 0.097550 -0.115409 -0.219866 0.190462 -0.149650 0.018093
polarizability: 1.84468554e+02 3.43106250e+00 1.27404364e+02 -7.35457060e+00 2.19053731e+00 6.46347595e+01
1716.lowfreq: -6.2935 -6.2084 -2.8003 0.0016 0.0016 0.0022 43.0562 53.4241 63.9385
frequency: 42.9920 53.4119 63.9129 77.5843 95.7203 141.1143 162.3622 191.8372 260.4755 282.3470 323.8946 374.3527 401.4054 424.6841 508.5494 548.6373 595.7715 634.1419 661.9439 668.8036 718.8454 762.6113 786.5347 890.8951 903.5002 937.2766 946.2702 954.2806 986.7046 996.4349 1012.7158 1070.3747 1119.6643 1123.5910 1202.5190 1215.2616 1243.2917 1286.1147 1296.6720 1345.1252 1367.6711 1414.8792 1427.5580 1431.8492 1448.7228 1449.6359 1511.7325 1561.7914 1633.4944 1659.2907 2972.1144 3017.5711 3029.8128 3080.7492 3094.4922 3149.8091 3156.5268 3165.7892 3197.3118 3488.0883
redmass: 3.4100 3.0994 3.0277 1.3121 2.5989 3.2428 6.5022 3.4148 5.0581 6.5889 4.3407 2.9135 2.8773 3.2616 3.9811 6.4844 2.5407 6.8482 7.1154 4.0118 1.8560 2.3766 4.2168 2.0421 2.5944 1.9345 1.4540 1.5633 1.1743 1.2654 1.1559 4.1030 1.9497 3.1398 2.0868 1.7880 2.5331 1.2989 1.3640 1.1352 1.9162 2.5123 1.2055 1.0521 1.1220 1.0624 4.8694 5.1682 7.1110 4.7535 1.0598 1.0983 1.0280 1.0717 1.0815 1.0927 1.1044 1.1061 1.1145 1.0777
irintensity: 0.5991 1.5360 0.3414 0.6912 0.4872 1.1738 12.8615 1.3545 2.7484 3.0960 4.8293 1.8067 13.0194 8.6070 2.2458 2.9342 18.0939 5.6500 6.3884 4.2470 20.7797 67.9689 15.8663 21.7527 7.8251 3.1115 16.6597 81.5372 9.0492 6.0344 15.6987 5.5629 20.7911 41.4998 1.3988 78.0965 67.1420 5.6793 2.1131 8.4319 2.0576 7.0692 5.0080 15.2420 7.4497 13.3033 504.1927 1.9104 476.4263 24.8241 8.1265 6.6738 17.1142 18.9902 6.0233 17.7139 4.9209 7.4046 26.0935 34.8225
temp: 298.150 k
press: 1.00000 atm
elementType: 16 8 7 7 6 6 6 6 6 6 6 6 1 1 1 1 1 1 1 1 1 1
symmnumber: 1
zpe: 440055.4 jmol-1
zpe.correction: 0.167608 hartree
zpe.thermalcorrener: 0.180344 hartree
zpe.thermalcorrenthalpy: 0.181288 hartree
zpe.thermalcorrgfe: 0.126855 hartree
zpe.sumelectzpe: -892.733982 hartree
zpe.sumelectthermal: -892.721246 hartree
zpe.sumelectthermalent: -892.720302 hartree
zpe.sumelectthermalfe: -892.774735 hartree
dipole: -1.9485 -2.7549 0.0098
dipole: 3.3743
quadrupole: -69.8571 -84.2976 -78.1021
quadrupole: -3.6080 -0.7397 -0.5562
quadrupole: 7.5619 -6.8787 -0.6831 -3.6080 -0.7397 -0.5562
hfenergy: -892.9015899 hartree
pointgroup: C01 [X(C8H10N2O1S1)]
dipole: -0.7726715 0.9527247 -0.5076766 debye
dipolederiv: -0.7990128 0.1788604 -0.1354852 0.0092953 -0.0857025 0.0018969 -0.0544197 0.0145979 -0.0918893 -0.6499499 0.2020677 -0.1172395 0.4071191 -1.0566836 0.3453534 -0.1982062 0.3425018 -0.5384872 -1.0139169 0.4882485 -0.2798232 0.0846195 -0.478214 0.1238712 -0.1033409 0.1452083 -0.2988621 -1.5267676 0.0879465 -0.1385174 -0.764185 -0.4590307 0.0646401 0.2777731 0.131059 -0.238235 0.1864798 -0.0759162 0.0853728 0.322956 -0.5524914 0.2573323 0.0220565 0.2716658 -0.1887726 -0.0190541 -0.0234173 -0.0129338 -0.1396225 0.0099599 0.0822695 -0.1319782 0.0360116 0.0646974 0.9159131 -0.3567917 0.2245834 -0.5425911 1.2234689 -0.5114217 0.3228308 -0.5065646 0.4676194 0.8696166 -0.1737158 0.1403614 0.0555283 0.3405392 -0.1727081 0.0004595 -0.1856066 0.0373969 1.7021124 -0.2080201 0.2095434 0.5776277 0.5006507 -0.1648268 -0.1652468 -0.2282708 0.1373895 -0.0276808 0.1860608 -0.0162231 0.3787207 0.0820611 -0.018841 -0.1540522 -0.0732986 0.170211 -0.3691045 0.1127889 0.0115925 0.0618398 -0.2561439 -0.0219909 0.0207619 -0.026206 0.1102649 0.0633944 -0.0891714 0.0424144 -0.1288633 0.1642997 -0.0592907 0.0642104 -0.0550439 0.0784281 -0.0535836 -0.0244238 -0.0537348 -0.059782 0.0829974 -0.0685649 -0.0155721 -0.0182292 -0.0808019 0.0418417 -0.0158585 0.0226188 0.0590576 -0.0399003 -0.0228657 0.0722573 0.0076464 0.1010805 0.0546077 -0.0460114 0.0200053 -0.1245415 0.0046353 0.043323 0.0393377 0.0462451 0.1113297 0.1580975 -0.0128285 -0.0051248 -0.0191928 0.2173141 0.0505533 -0.0036874 0.0523335 0.3026308 0.1169735 -0.036928 -0.0532257 -0.0765659 0.0724732 -0.0284151 0.0104038 -0.0169089 -0.1215779 0.1054137 -0.0084646 0.0900502 0.0505715 0.0213503 0.0506989 0.0413543 0.0252692 -0.0368052 0.1188722 -0.0593341 -0.0385339 0.0203434 -0.0566273 -0.0391459 -0.0548719 -0.0244174 0.0191604 -0.1089031 0.0332719 -0.0356464 0.0198254 0.0841743 0.0227974 -0.0276324 0.0234566 0.1201806 0.0816997 -0.106202 0.0584076 -0.1434929 0.065675 0.0713374 0.0810939 0.0794364 -0.0139565 0.1529509 -0.0521614 -0.0184619 -0.0486675 0.1151946 -0.0060025 -0.0435316 -0.0408857 -0.1110016 unknown
polarizability: 183.4594132|2.9715954|117.3406183|13.4199283|-22.8453261|75.7076459 unknown
InChI: InChI=1S/C8H10N2OS/c1-3-4-6-5-9-8(12-2)10-7(6)11/h3,5,10H,1,4H2,2H3
charge 0 multiplicity 1
22 atoms
S  -3.669521 -0.336993 -0.199354
O  0.686254 -2.529239 1.120623
N  -1.231193 -1.371827 0.441607
N  -1.176584 0.786177 -0.559238
C  0.929882 -0.318676 0.100144
C  2.442312 -0.343372 0.239759
C  0.192471 -1.486398 0.59727
C  0.214093 0.739877 -0.444738
C  -1.850656 -0.264885 -0.113214
C  3.177408 0.551122 -0.736304
C  4.04842 1.532082 -0.391193
C  -4.008755 1.333542 -0.989579
H  2.716717 -0.075704 1.279706
H  2.766534 -1.396699 0.114594
H  0.737509 1.624614 -0.821195
H  -1.776034 -2.174966 0.776882
H  2.987223 0.351138 -1.802569
H  -3.502449 1.386085 -1.962549
H  -3.639968 2.131049 -0.330931
H  -5.102574 1.382907 -1.103977
H  4.574008 2.125808 -1.147438
H  4.265001 1.764859 0.659096
