program: Gaussian 09
title: 000295778
version: EM64L-G09RevD.01
frameworkgroup: C1[X(C9H13N3O3)]
method: RPBEPBE
basis: SDD
operation: Freq
keyword: #p
keyword: freq=noraman
keyword: PBEPBE/SDD
title: #p freq=noraman PBEPBE/SDD
converged: YES YES NO NO
title: Mulliken charges:
elementType: O O O N N N C C C C C C C C C H H H H H H H H H H H H H
charge: -0.250103 -0.319551 -0.280447 -0.089436 0.008385 -0.631486 0.195882 -0.124810 0.140882 -0.017560 -0.368741 0.138566 -0.745230 -0.506098 -0.506534 0.234387 0.294637 0.241556 0.245492 0.242230 0.210014 0.237217 0.245100 0.233621 0.236787 0.219299 0.392162 0.323777
chargesum: 0.00000
title: Mulliken charges with hydrogens summed into heavy atoms:
elementType: O O O N N N C C C C C C C C C
charge: -0.250103 -0.319551 -0.280447 -0.089436 0.008385 0.084453 0.195882 0.109577 0.140882 -0.017560 -0.074104 0.138566 -0.015952 0.186233 0.183173
polarizability: 1.58848034e+02 8.08110416e+00 1.38997800e+02 4.29275145e+00 -1.59541448e+00 9.04181524e+01
1716.lowfreq: -11.7424 -7.1391 -0.0008 -0.0007 -0.0004 7.7764 41.3289 47.5962 63.8765
frequency: 41.2920 47.5948 63.8680 73.2052 89.6825 96.2923 120.4209 142.4724 146.5714 204.8257 213.1248 248.5565 256.1270 269.1080 316.5948 342.2331 354.3814 398.9332 433.2972 495.7383 523.7013 573.7868 593.3564 637.1497 656.7787 698.4920 726.2973 794.8702 796.5508 807.3935 845.7705 898.9273 937.3260 965.8168 991.2548 1000.0860 1052.8335 1064.6090 1098.0932 1111.5899 1119.7351 1124.3403 1145.7239 1164.6187 1209.7068 1240.5256 1251.8883 1291.6342 1325.7083 1359.4778 1368.9086 1393.6974 1424.9617 1428.2969 1436.0467 1455.5327 1456.5821 1457.5266 1459.9218 1474.1511 1477.0169 1501.6076 1535.0931 1598.2065 1642.8142 2948.5536 2962.8641 2964.6522 2998.0721 3051.6435 3066.9668 3079.4993 3117.3805 3130.9517 3131.6043 3158.3152 3314.7240 3607.3903
redmass: 3.6616 1.0568 3.4097 3.8435 3.8632 2.3512 3.2897 1.3890 1.2211 3.7801 4.7812 4.9501 4.5645 4.7064 4.4405 4.1752 5.2554 4.0281 3.1823 5.0439 4.2925 4.5252 1.5627 3.1735 7.8193 4.5697 5.8456 2.9183 5.2731 1.3338 6.4507 4.8960 4.2770 1.5402 9.1985 1.9813 1.6540 4.6270 3.3523 1.2841 1.3948 1.5842 1.3479 1.8250 3.9883 5.3809 2.1175 1.9202 1.1805 2.4101 2.5069 1.3548 2.5445 1.3361 1.1320 1.0674 1.0542 1.2477 1.0522 1.0561 1.0550 5.2714 6.1202 4.0972 1.3605 1.0849 1.0326 1.0352 1.0379 1.1038 1.0991 1.0961 1.1008 1.1002 1.1019 1.0932 1.0638 1.0903
irintensity: 0.4093 0.5731 2.1153 1.8619 1.7284 3.5108 4.6684 2.1881 1.5597 4.5927 11.0532 5.6667 5.7661 6.0259 4.4310 6.4509 7.2771 4.8226 3.0497 8.9439 16.4826 2.6673 70.6063 21.8869 19.8083 14.9917 30.5153 14.3437 6.1942 136.0457 72.7745 19.8635 16.5404 5.8954 162.1250 8.1530 8.7034 67.6537 64.5404 2.6233 2.4222 1.5231 6.7337 26.0445 2.4128 8.7464 22.2596 3.1066 10.4061 170.7161 74.4978 42.7147 36.5416 24.2898 4.0704 12.7980 12.6461 16.7508 13.1483 11.1268 12.5029 11.2291 127.5631 202.1395 179.4706 26.7057 50.8541 79.5846 6.0906 46.1034 35.3692 10.2198 20.0571 10.3348 15.8055 0.4164 306.4136 73.1558
temp: 298.150 k
press: 1.00000 atm
elementType: 8 8 8 7 7 7 6 6 6 6 6 6 6 6 6 1 1 1 1 1 1 1 1 1 1 1 1 1
symmnumber: 1
zpe: 574239.5 jmol-1
zpe.correction: 0.218716 hartree
zpe.thermalcorrener: 0.234703 hartree
zpe.thermalcorrenthalpy: 0.235647 hartree
zpe.thermalcorrgfe: 0.174438 hartree
zpe.sumelectzpe: -739.525333 hartree
zpe.sumelectthermal: -739.509347 hartree
zpe.sumelectthermalent: -739.508403 hartree
zpe.sumelectthermalfe: -739.569612 hartree
dipole: 3.0517 -5.6126 1.9827
dipole: 6.6892
quadrupole: -79.2729 -96.5430 -83.7824
quadrupole: 0.4013 0.1946 2.4805
quadrupole: 7.2599 -10.0103 2.7504 0.4013 0.1946 2.4805
hfenergy: -739.7440496 hartree
pointgroup: C01 [X(C9H13N3O3)]
dipole: -1.2836795 2.0911832 -0.9513687 debye
polarizability: 153.7300758|-5.0179712|112.3952972|-17.2265804|-23.1703806|122.1386135 unknown
InChI: InChI=1S/C9H13N3O3/c1-5-11-4-6(8(10)13)7(12-5)9(14-2)15-3/h4,9H,10H2,1-3H3
charge 0 multiplicity 1
28 atoms
O  -2.061118 -0.712622 -0.607014
O  -1.824747 1.368703 0.474695
O  -0.003343 -2.404993 2.660539
N  1.121003 0.451039 -1.062601
N  2.8560 -0.731473 0.148309
N  -1.420992 -0.572416 2.455675
C  0.180172 0.014927 -0.163857
C  -1.233369 0.442516 -0.54147
C  0.538131 -0.778171 0.961595
C  2.424285 0.084072 -0.870222
C  1.912099 -1.143505 1.035722
C  -0.339045 -1.326169 2.073506
C  3.458074 0.58126 -1.844837
C  -3.379022 -0.465843 -1.221824
C  -1.346632 2.754473 0.351233
H  -1.181526 0.993894 -1.506927
H  2.235435 -1.805094 1.845755
H  4.287134 1.073501 -1.30692
H  3.899124 -0.268901 -2.396607
H  3.005316 1.282187 -2.561471
H  -3.260964 -0.097702 -2.260957
H  -3.956847 0.263514 -0.627303
H  -3.885477 -1.441859 -1.227131
H  -0.25818 2.826879 0.53717
H  -1.892281 3.333073 1.11238
H  -1.571825 3.156187 -0.656094
H  -1.718212 0.258239 1.919616
H  -2.008094 -0.948116 3.200541
