program: Gaussian 09
title: 000295776
version: EM64L-G09RevD.01
frameworkgroup: C1[X(C12H8N6)]
method: RPBEPBE
basis: SDD
operation: Freq
keyword: #pfreq=noraman
keyword: PBEPBE/SDD
title: #p freq=noraman PBEPBE/SDD
converged: YES YES NO NO
title: Mulliken charges:
elementType: N N N N N N C C C C C C C C C C C C H H H H H H H H
charge: -0.058432 -0.058433 0.029115 0.029118 -0.017588 -0.017588 0.095587 0.095584 0.227498 0.227496 -0.010426 -0.010426 -0.384912 -0.384910 -0.744235 -0.744235 -0.183808 -0.183808 0.281223 0.281223 0.247923 0.247944 0.270113 0.270114 0.247944 0.247923
chargesum: 0.00000
title: Mulliken charges with hydrogens summed into heavy atoms:
elementType: N N N N N N C C C C C C C C C C C C
charge: -0.058432 -0.058433 0.029115 0.029118 -0.017588 -0.017588 0.095587 0.095584 0.227498 0.227496 -0.010426 -0.010426 -0.103689 -0.103687 0.021745 0.021744 -0.183808 -0.183808
polarizability: 2.36432023e+02 -2.31190030e+01 2.18412652e+02 2.41540874e-02 -2.50392127e-02 7.37687247e+01
1716.lowfreq: -7.2606 -5.2956 -0.0007 -0.0005 -0.0003 7.0011 11.7023 55.0394 56.8567
frequency: 11.7023 55.0293 56.8567 68.8444 73.4763 79.6117 99.3507 143.5575 177.7811 216.5240 236.3579 239.6263 246.8003 300.6792 354.7103 385.3900 409.0700 412.1529 437.3079 468.5998 480.0906 533.6714 553.7718 593.7908 604.3678 644.0549 670.0664 695.8974 704.0480 733.5680 779.9655 822.5475 827.1540 899.5091 948.7699 948.9008 983.8434 1016.7855 1024.3628 1051.8149 1052.1774 1151.6701 1203.6597 1218.4492 1229.2459 1264.7844 1276.2518 1277.7735 1318.3946 1381.9929 1395.9791 1400.5083 1421.7994 1422.7936 1442.2675 1454.9031 1454.9149 1460.4018 1469.4126 1493.0971 1527.0495 1542.0645 2165.7903 2166.5152 2998.4089 2998.4115 3078.2662 3078.2830 3136.0377 3136.0533 3149.7096 3149.7479
redmass: 6.0685 1.0897 1.0525 5.3393 3.8076 5.9167 5.6538 9.5234 8.4118 6.1296 10.5171 4.4366 7.1415 7.6336 3.1370 5.4157 3.6931 3.3319 7.6567 6.0704 6.9741 8.3406 7.4587 6.5027 6.0133 10.1851 4.2548 7.8564 6.9011 8.2165 4.1974 7.6246 7.0663 4.3932 1.5103 1.5362 1.7790 1.9757 5.6882 1.6426 1.6462 9.4472 5.7937 4.1400 4.6287 7.2674 2.9612 3.1902 2.4622 2.0860 1.2535 1.6379 2.8752 2.5431 2.2212 1.0468 1.0468 1.3971 1.9755 5.5571 5.8679 6.6390 12.6318 12.6304 1.0380 1.0380 1.0961 1.0961 1.1006 1.1006 1.0938 1.0937
irintensity: 2.4620 0.0009 0.9331 0.1942 0.0000 0.1981 0.1016 0.0000 12.6093 0.0000 0.0000 0.0000 21.9049 0.0000 31.1820 0.0000 3.1949 0.0000 7.3512 0.0000 0.0149 1.9922 0.0000 0.0000 0.1258 27.4207 0.0000 0.0000 4.4814 0.0000 4.5330 0.3583 0.0000 0.0000 0.0022 16.0777 6.1389 0.0000 1.3453 20.2983 0.0009 0.0000 0.0000 21.9928 1.7767 1.7726 0.0000 0.0000 11.2242 0.0000 45.0880 0.0002 0.0018 356.0381 143.8249 30.5723 3.3796 0.0002 13.1871 0.0000 267.6006 0.0001 0.0000 14.4553 0.5441 1.6320 1.1262 11.4256 2.5112 5.7439 0.0673 9.2092
temp: 298.150 k
press: 1.00000 atm
elementType: 7 7 7 7 7 7 6 6 6 6 6 6 6 6 6 6 6 6 1 1 1 1 1 1 1 1
symmnumber: 1
zpe: 471970.0 jmol-1
zpe.correction: 0.179764 hartree
zpe.thermalcorrener: 0.196027 hartree
zpe.thermalcorrenthalpy: 0.196971 hartree
zpe.thermalcorrgfe: 0.133508 hartree
zpe.sumelectzpe: -789.316192 hartree
zpe.sumelectthermal: -789.299929 hartree
zpe.sumelectthermalent: -789.298985 hartree
zpe.sumelectthermalfe: -789.362448 hartree
dipole: 0.0000 0.0000 0.0075
dipole: 0.0075
quadrupole: -96.1486 -124.6458 -100.9953
quadrupole: 5.3913 0.0196 -0.0104
quadrupole: 11.1146 -17.3825 6.2679 5.3913 0.0196 -0.0104
hfenergy: -789.4959562 hartree
pointgroup: C01 [X(C12H8N6)]
dipole: 0.0000044 -0.0029332 0.0000093 debye
dipolederiv: -0.9595837 0.0006007 0.2656337 0.0010302 -0.1617191 -0.0002805 0.0957546 0.0003771 -0.4167989 -0.9595745 0.0022876 0.2656326 0.0023941 -0.1617275 -0.0005493 0.0957509 -0.0003697 -0.4168003 -0.4858716 0.0007057 -0.0190321 -0.0000476 -0.2158818 0.0012097 0.3549933 0.0003633 -0.6210184 -0.4858683 0.0008538 -0.0190301 0.000687 -0.2158806 0.0002922 0.3549933 -0.0008889 -0.6210204 -0.2394857 0.0000225 -0.0422946 0.0001992 -0.237625 0.0004766 -0.0582788 0.0004806 -0.3822083 -0.2394859 -0.0000241 -0.0422965 -0.0000507 -0.2376236 -0.0000725 -0.0582842 0.000061 -0.3822131 0.5135478 -0.0005976 0.0743342 -0.0013666 0.0611992 -0.0005923 0.1265291 -0.0009471 0.411835 0.5135484 -0.0014733 0.0743277 -0.0012607 0.0612011 -0.0003212 0.1265236 -0.0003739 0.4118276 -0.4438759 0.00169 -0.2014093 0.0018053 0.1804009 0.0010591 -0.1316939 0.00087 -0.1288383 -0.4438782 0.001626 -0.201414 0.0015546 0.1804036 0.0005499 -0.1316914 0.0004983 -0.1288387 0.824901 0.0000757 -0.5022999 0.0017666 0.0957988 -0.0018493 -0.6518362 -0.0006325 0.6752767 0.8249027 -0.0017198 -0.5023007 -0.0011123 0.0957988 0.000523 -0.6518315 0.0015224 0.6752718 0.5630052 -0.0016623 0.1893219 -0.0016048 -0.0127702 -0.0009434 0.0220768 -0.0007252 0.3129834 0.5630063 -0.0016727 0.1893247 -0.0016007 -0.0127717 -0.0005024 0.0220803 -0.0001167 0.3129818 -0.3082874 -0.0006674 0.3138577 -0.0040592 0.0064805 0.0036622 0.2184846 0.0003295 -0.1686112 -0.3083256 0.000564 0.3138896 -0.0008243 0.0064863 0.0006436 0.2184655 -0.0003691 -0.1685833 0.2100305 -0.0005525 0.0778966 -0.000702 0.0487367 -0.0007396 0.0450213 -0.0005729 0.2182947 0.2100342 -0.0002006 0.077904 -0.0001029 0.0487331 0.0000841 0.0450271 0.0000971 0.218298 0.0933264 0.0001204 -0.025629 0.0002137 0.1207906 0.0002647 -0.0384066 0.0003524 -0.0304681 0.0933259 0.0000833 -0.0256286 0.0000957 0.120791 0.0000392 -0.0384076 0.0001073 -0.0304684 0.0794145 0.0860335 -0.0072724 0.1047923 -0.0030692 -0.006918 0.0241547 0.0347479 0.0649836 0.0812951 -0.0850368 -0.0064352 -0.1027402 -0.0055341 0.0060182 0.0259358 -0.0338664 0.0653599 0.0715825 -0.0008389 -0.1166721 0.0002794 0.1231947 -0.0014491 -0.0327337 -0.0008717 -0.0007875 0.0715865 -0.0002951 -0.1166857 0.0001168 0.1231977 -0.0003328 -0.0327326 -0.0003694 -0.0007921 0.0803989 -0.0855045 -0.0066797 -0.1035054 -0.0044469 0.0063311 0.0253969 -0.0341622 0.0652404 0.080331 0.0855824 -0.007043 0.1040427 -0.0041634 -0.006603 0.0247089 0.0344588 0.065094 unknown
polarizability: 227.265695|-0.3357054|73.7696057|-24.81235|-0.0974185|227.5780984 unknown
InChI: InChI=1S/C12H8N6/c1-7-15-5-9(3-13)11(17-7)12-10(4-14)6-16-8(2)18-12/h5-6H,1-2H3
charge 0 multiplicity 1
26 atoms
N  -1.57108 -0.449275 0.911501
N  1.571112 -0.455465 -0.910085
N  -3.50175 -0.441921 -0.545559
N  3.501783 -0.460971 0.546981
N  0.021231 -0.444987 -3.797562
N  -0.021202 -0.450177 3.79897
C  -0.725739 -0.449391 -0.158642
C  0.725771 -0.453217 0.160058
C  -1.238353 -0.4459 -1.494387
C  1.238387 -0.454555 1.495802
C  -2.918635 -0.445686 0.704473
C  2.918665 -0.459154 -0.703057
C  -2.663876 -0.442121 -1.610697
C  2.663912 -0.458593 1.612117
C  -3.824479 -0.446554 1.901858
C  3.824505 -0.461147 -1.900445
C  -0.466934 -0.445681 -2.70427
C  0.46697 -0.452053 2.705682
H  -3.127984 -0.439219 -2.602801
H  3.128019 -0.459945 2.604224
H  -4.490012 0.434925 1.87707
H  -4.479248 -1.336409 1.883504
H  -3.232185 -0.440497 2.828145
H  3.232178 -0.462856 -2.82673
H  4.484217 0.42496 -1.880604
H  4.485127 -1.346411 -1.877146
