program: Gaussian 09
title: 000295774
version: EM64L-G09RevD.01
frameworkgroup: C1[X(C10H15N3S)]
method: RPBEPBE
basis: SDD
operation: Freq
keyword: #p
keyword: freq=noraman
keyword: PBEPBE/SDD
title: #p freq=noraman PBEPBE/SDD
converged: YES YES NO NO
title: Mulliken charges:
elementType: S N N N C C C C C C C C C C H H H H H H H H H H H H H H H
charge: 0.261792 -0.135028 -0.051267 0.019594 -0.403592 -0.373115 -0.376954 -0.383878 -0.407268 0.315785 -0.313430 -0.297393 -0.409059 -0.833950 0.191781 0.224933 0.203221 0.211309 0.212252 0.203155 0.209159 0.213892 0.202801 0.276386 0.217351 0.242001 0.269530 0.241426 0.268567
chargesum: 0.00000
title: Mulliken charges with hydrogens summed into heavy atoms:
elementType: S N N N C C C C C C C C C C
charge: 0.261792 -0.135028 -0.051267 0.019594 0.013121 0.041415 0.038453 0.039173 0.071918 0.315785 -0.096078 -0.055392 -0.409059 -0.054427
polarizability: 2.03301925e+02 -3.95354852e+00 1.63064168e+02 -7.88134570e+00 -3.96571187e+00 8.49601064e+01
1716.lowfreq: -4.7831 0.0015 0.0019 0.0022 6.9918 12.3628 29.4780 42.7535 77.9576
frequency: 29.3058 42.5064 77.9561 107.1020 128.4562 149.7888 171.0519 174.2452 248.3657 260.4263 320.9589 357.4474 383.7521 393.4281 433.5485 440.7982 485.2274 516.0666 577.0191 638.6719 662.4167 683.6730 754.8753 777.0156 795.6271 804.6165 837.3209 845.8837 902.1044 920.8857 947.2323 951.9107 955.8339 977.1128 988.7157 1019.1049 1048.6841 1085.7337 1087.6409 1122.9925 1143.2944 1153.7160 1177.4440 1229.1062 1252.5355 1264.5415 1270.7112 1275.2865 1326.9509 1327.9330 1337.7226 1344.1833 1347.6437 1350.6844 1358.1214 1372.3924 1435.4232 1442.7581 1454.4703 1456.7455 1463.8880 1467.4053 1469.4568 1479.8192 1516.4677 1561.9022 2946.1277 2949.3748 2969.2678 2987.2944 2988.4401 3016.9106 3038.9733 3048.0170 3056.6942 3100.3351 3101.1820 3136.2354 3139.6290 3144.4136 3189.0771
redmass: 3.7452 3.2328 3.6923 3.7162 1.2034 3.4266 4.4573 3.1678 2.4814 2.2906 4.0096 5.4027 2.9741 2.5983 3.1550 3.2230 2.4718 4.5375 2.5251 5.4512 6.5396 6.4153 3.1566 5.3518 1.8475 1.5750 2.5907 1.5353 2.5302 8.4045 1.3673 2.6534 1.3997 1.1786 1.3354 2.4420 1.9689 1.7954 1.5723 2.8809 2.1268 1.3135 2.8877 2.0895 1.3217 1.5108 3.5214 1.1804 1.4171 1.6435 1.3424 1.4762 1.4770 1.6125 1.4242 1.6787 1.0547 3.2238 1.1015 1.1129 1.0882 1.1292 1.0806 1.1372 4.7596 5.7176 1.0706 1.0715 1.0639 1.0609 1.0610 1.0282 1.0963 1.1029 1.1034 1.0902 1.0920 1.0910 1.1036 1.1055 1.0941
irintensity: 0.1020 0.1633 4.0784 0.1353 0.6503 0.6039 2.2920 0.8985 2.7826 1.3494 2.1930 8.9220 4.8220 2.8085 0.6057 0.5450 1.6957 2.6713 0.7769 0.7111 1.0214 8.1943 1.5513 12.9793 30.0602 17.2500 4.4340 19.1124 3.9770 10.0743 6.9041 81.7768 1.5542 9.2596 1.2124 11.2779 17.1642 0.5533 30.0867 18.0793 0.8322 8.7696 185.0725 0.4927 29.1112 43.6039 31.6242 5.7135 31.9213 67.3022 10.2537 13.8662 0.2325 65.2168 14.3653 111.4368 15.8334 152.3420 3.5786 6.2513 13.9061 21.3018 5.2821 11.6041 130.1983 742.7532 23.6949 92.2417 44.0439 31.4072 30.1235 23.6150 62.6496 29.6737 88.5547 22.2505 3.0786 21.4953 15.6844 15.8745 17.2703
temp: 298.150 k
press: 1.00000 atm
elementType: 16 7 7 7 6 6 6 6 6 6 6 6 6 6 1 1 1 1 1 1 1 1 1 1 1 1 1 1 1
symmnumber: 1
zpe: 629224.2 jmol-1
zpe.correction: 0.239659 hartree
zpe.thermalcorrener: 0.253343 hartree
zpe.thermalcorrenthalpy: 0.254287 hartree
zpe.thermalcorrgfe: 0.198022 hartree
zpe.sumelectzpe: -951.312377 hartree
zpe.sumelectthermal: -951.298693 hartree
zpe.sumelectthermalent: -951.297748 hartree
zpe.sumelectthermalfe: -951.354014 hartree
dipole: -6.3093 -1.0731 0.6401
dipole: 6.4318
quadrupole: -97.8771 -81.8990 -93.1959
quadrupole: -7.6415 0.5457 -0.1222
quadrupole: -6.8864 9.0917 -2.2053 -7.6415 0.5457 -0.1222
hfenergy: -951.5520358 hartree
pointgroup: C01 [X(C10H15N3S1)]
dipole: 2.4792227 0.2318519 0.4504961 debye
polarizability: 199.6166177|-5.4854622|163.4167403|19.6771746|-8.5072788|88.2928422 unknown
InChI: InChI=1S/C10H15N3S/c1-14-10-11-6-5-9(12-10)13-7-3-2-4-8-13/h5-6H,2-4,7-8H2,1H3
charge 0 multiplicity 1
29 atoms
S  -3.615085 1.217106 -0.733373
N  1.14766 -0.136658 0.480619
N  -1.080911 0.381611 -0.07916
N  -2.812369 -1.312955 -0.368236
C  3.874209 0.722409 -0.157315
C  3.47221 -0.771164 -0.157795
C  2.648445 1.611776 -0.472833
C  2.283303 -1.024051 0.801653
C  1.482153 1.307002 0.494647
C  -0.134622 -0.581583 0.211433
C  -0.52357 -1.963807 0.21855
C  -1.864968 -2.258389 -0.077625
C  -2.341817 -0.029952 -0.34716
C  -2.609556 2.797824 -0.598553
H  4.275979 0.993535 0.841375
H  4.684197 0.90231 -0.888547
H  4.325444 -1.405404 0.150699
H  3.18103 -1.079243 -1.180832
H  2.311604 1.430982 -1.512054
H  2.914346 2.683146 -0.392238
H  1.972705 -2.077896 0.752003
H  2.608301 -0.824168 1.845926
H  1.775314 1.591858 1.528693
H  0.571185 1.861247 0.225942
H  0.167114 -2.776988 0.444723
H  -2.214535 -3.296931 -0.084366
H  -2.199871 2.895794 0.416951
H  -3.315241 3.615729 -0.814762
H  -1.791158 2.785859 -1.332566
