program: Gaussian 09
title: 000295773
version: EM64L-G09RevD.01
frameworkgroup: C1[X(C6H5N3O2S)]
method: RPBEPBE
basis: SDD
operation: Freq
keyword: #p
keyword: freq=noraman
keyword: PBEPBE/SDD
title: #p freq=noraman PBEPBE/SDD
converged: NO NO NO NO
title: Mulliken charges:
elementType: S O O N N N C C C C C C H H H H H
charge: 0.249724 -0.244833 -0.122301 -0.332925 0.038247 0.011413 -0.203426 0.150720 0.118106 -0.342389 -0.798883 0.025237 0.351469 0.269673 0.290459 0.249325 0.290384
chargesum: 0.00000
title: Mulliken charges with hydrogens summed into heavy atoms:
elementType: S O O N N N C C C C C C
charge: 0.249724 -0.244833 -0.122301 0.018544 0.038247 0.011413 -0.203426 0.150720 0.118106 -0.072716 0.031285 0.025237
polarizability: 2.19443208e+02 -1.00198269e+01 9.94527590e+01 -1.32520662e-02 7.71833755e-03 4.49369963e+01
1716.lowfreq: -7.1912 -0.0006 0.0014 0.0017 5.5948 7.7807 50.3745 61.2296 65.5554
frequency: 50.3648 61.2194 65.5457 97.6266 142.2353 158.5752 171.4062 276.8919 322.4542 350.7404 370.0220 398.0159 483.0708 493.7662 535.9347 557.6630 633.4387 640.6626 659.1370 710.9833 718.3430 765.2241 911.5317 914.1003 986.3813 997.6404 1039.5863 1133.5929 1173.6105 1244.0503 1328.7032 1344.6403 1408.1562 1432.2310 1438.1717 1448.2926 1512.8020 1583.9294 1630.8685 2258.1024 3032.3736 3160.9835 3169.8503 3169.9733 3486.3760
redmass: 5.4093 4.2424 11.9098 1.1463 9.0746 3.8969 7.4331 7.3642 9.9747 13.0189 7.0059 3.3617 8.3104 12.6438 10.1739 10.0777 8.6556 9.8902 8.1577 7.2164 1.6027 3.4713 6.6164 1.4452 1.1739 1.2713 8.9341 2.9159 8.3902 2.8683 1.9239 1.1332 2.5040 1.0519 5.6126 1.0860 4.9881 7.8937 7.0320 12.7105 1.0277 1.1047 1.0937 1.1064 1.0778
irintensity: 0.8666 1.2581 0.4282 0.0820 0.8172 2.6941 10.9240 0.7025 0.1035 15.7420 6.6685 5.0808 6.3344 13.2677 4.2325 11.4693 41.2030 6.0395 9.4957 1.5294 38.5335 64.5100 21.6821 17.3948 8.7971 6.5720 19.1712 113.7813 20.6547 51.4691 1.6974 7.9348 2.3393 15.7567 17.4514 7.1925 468.0110 42.6062 320.3795 1461.8278 15.2420 5.4057 15.9708 6.4603 38.9622
temp: 298.150 k
press: 1.00000 atm
elementType: 16 8 8 7 7 7 6 6 6 6 6 6 1 1 1 1 1
symmnumber: 1
zpe: 289910.6 jmol-1
zpe.correction: 0.110421 hartree
zpe.thermalcorrener: 0.122073 hartree
zpe.thermalcorrenthalpy: 0.123017 hartree
zpe.thermalcorrgfe: 0.071311 hartree
zpe.sumelectzpe: -943.547498 hartree
zpe.sumelectthermal: -943.535846 hartree
zpe.sumelectthermalent: -943.534902 hartree
zpe.sumelectthermalfe: -943.586608 hartree
dipole: 5.8576 -1.5080 0.0052
dipole: 6.0486
quadrupole: -83.4684 -75.8129 -75.9031
quadrupole: 3.9906 0.0311 -0.0055
quadrupole: -5.0736 2.5819 2.4917 3.9906 0.0311 -0.0055
hfenergy: -943.6579195 hartree
pointgroup: C01 [X(C6H5N3O2S1)]
dipole: -2.2731119 0.6964335 0.1046852 debye
dipolederiv: -0.8606021 0.082211 0.0594798 -0.1796418 -0.0572969 0.0152845 0.0970501 -0.0084223 -0.0722574 -0.7306408 0.3393748 -0.0155961 0.4351961 -0.9148291 0.0413948 -0.0296465 0.0500778 -0.3626287 -1.9501872 0.2470664 0.1184825 0.4432344 -0.2872557 -0.0285802 0.0900455 -0.0111406 -0.2191468 -0.96094 0.4135255 0.0060374 -0.064716 -0.3557073 0.024166 0.0751024 -0.0183712 -0.2311783 -1.1833312 0.0502725 0.0808113 -1.0740067 -0.6109301 0.1558136 0.2423248 0.0554068 -0.2256347 -2.0782601 0.2515301 0.1293667 0.466194 -0.4965263 -0.0003942 0.0980813 0.0186168 -0.2243215 1.4868568 -0.0873378 -0.1172153 0.9604996 0.6089548 -0.16931 -0.26868 -0.0755586 0.0683011 0.9290889 -0.4670085 0.0062591 -0.6673173 1.0782609 -0.0603241 0.0354009 -0.0781067 0.2548516 1.1514051 0.0588 -0.1040384 0.4616447 -0.3813985 0.0246321 -0.1618781 0.060428 0.0803027 0.7291117 -0.1632187 -0.0467119 0.3248961 0.4125509 -0.0970806 -0.1168357 -0.053753 -0.0424583 0.1531383 -0.1221075 0.0080874 -0.182656 0.1425629 0.0029837 0.0174209 -0.0024497 0.0509196 2.9677147 -0.5331913 -0.1585775 -0.9395424 0.6190703 0.0391521 -0.099744 0.0030332 0.3210814 0.1715787 -0.0063353 0.0153526 -0.008079 0.1975053 0.0206528 0.0157809 0.0204036 0.330493 0.0724252 -0.0388656 0.0128359 -0.0973507 -0.014566 0.0328832 0.0211658 0.0276942 0.1476761 0.095105 -0.0231214 -0.0590617 0.0572214 -0.0264141 -0.07329 -0.0594174 -0.0400898 0.0215962 -0.1043334 -0.0017515 0.0224882 -0.017589 0.0801375 0.0096315 0.024656 0.0081593 0.1307364 0.1118702 0.0001573 0.0419999 0.0820127 0.0058814 0.0623848 0.0191733 0.044072 -0.0283324 unknown
polarizability: 217.2448597|-16.2001813|99.569505|-13.0197258|-6.411653|47.0185988 unknown
InChI: InChI=1S/C6H5N3O2S/c1-12-6-7-2-4(8-3-10)5(11)9-6/h2,9H,1H3
charge 0 multiplicity 1
17 atoms
S  -3.493223 -0.59664 0.467857
O  1.380632 -1.937571 0.227077
O  4.530168 -0.198392 -0.30232
N  -0.832979 -1.154954 0.311267
N  -1.401839 1.143509 0.030195
N  2.28347 0.74207 -0.239023
C  -1.755796 -0.117487 0.243415
C  0.571499 -0.969051 0.159455
C  0.940659 0.441597 -0.076605
C  -0.051214 1.418113 -0.129157
C  -4.306568 1.092811 0.301636
C  3.376477 0.166931 -0.252812
H  -1.136029 -2.121881 0.478367
H  0.212689 2.464845 -0.303466
H  -3.919234 1.759421 1.083297
H  -5.38346 0.905674 0.429814
H  -4.086251 1.504806 -0.6919
