program: Gaussian 09
title: 000295772
version: EM64L-G09RevD.01
frameworkgroup: C1[X(C6H8N2O2S)]
method: RPBEPBE
basis: SDD
operation: Freq
keyword: #p
keyword: freq=noraman
keyword: PBEPBE/SDD
title: #p freq=noraman PBEPBE/SDD
converged: YES YES NO NO
title: Mulliken charges:
elementType: S O O N N C C C C C C H H H H H H H H
charge: 0.240728 -0.435914 -0.254284 -0.341411 0.027460 0.187601 0.108145 -0.416106 -0.382799 -0.206950 -0.803528 0.250202 0.232429 0.345440 0.283294 0.289686 0.288976 0.246834 0.340197
chargesum: 0.00000
title: Mulliken charges with hydrogens summed into heavy atoms:
elementType: S O O N N C C C C C C
charge: 0.240728 -0.095717 -0.254284 0.004029 0.027460 0.187601 0.108145 0.066525 -0.099506 -0.206950 0.021968
polarizability: 1.58573287e+02 1.08856837e+01 1.07424936e+02 1.87536462e+00 -6.41627976e-01 5.20618134e+01
1716.lowfreq: -5.8849 -0.0015 0.0009 0.0026 6.0236 9.7474 54.8891 62.5160 81.1143
frequency: 54.8605 62.5099 81.1095 99.8987 134.5395 162.4033 199.7832 272.6828 279.9620 318.7004 364.0298 402.6464 427.3780 523.4955 564.4585 633.5070 642.7350 660.3304 717.6664 756.9329 770.7586 905.7308 924.5560 960.6590 984.8228 988.0199 998.9557 1072.0278 1122.7814 1161.3316 1217.4613 1240.0794 1300.4512 1335.5496 1346.5302 1379.4560 1414.2699 1432.2079 1448.8565 1458.1717 1508.7241 1561.4983 1635.6265 2980.2594 3030.5271 3057.3542 3157.7546 3161.3293 3167.0445 3486.3290 3554.8317
redmass: 2.5791 4.6580 1.3231 2.5181 4.4370 6.3371 5.2883 3.6634 4.1923 6.3928 1.3407 3.0396 7.4999 10.0371 6.0042 6.4569 7.4229 7.7607 1.8513 3.3190 3.8962 6.5693 1.4405 2.3905 2.2641 1.1746 1.3083 4.8739 3.9766 1.1470 3.3114 2.7494 1.3323 1.3426 1.1359 1.6661 2.5302 1.0518 1.0604 1.1008 4.7547 5.1942 7.3113 1.0652 1.0279 1.0967 1.1044 1.0925 1.1062 1.0778 1.0662
irintensity: 3.7103 1.9830 2.0896 1.2353 3.1203 13.8731 0.5464 14.5278 20.2872 4.0826 171.2707 8.4527 12.0690 2.4610 11.2930 7.1688 6.5608 5.8603 22.2782 33.3726 50.9381 15.0062 34.6384 70.2266 15.7590 9.3863 2.4041 25.9876 51.7926 20.0171 22.2040 91.7679 4.7449 33.9735 6.0352 6.4272 8.8049 15.2643 9.2156 3.0684 502.1399 0.0506 493.4494 20.3122 15.9893 10.8265 6.1095 6.2942 7.0377 34.7456 8.5424
temp: 298.150 k
press: 1.00000 atm
elementType: 16 8 8 7 7 6 6 6 6 6 6 1 1 1 1 1 1 1 1
symmnumber: 1
zpe: 365600.2 jmol-1
zpe.correction: 0.139250 hartree
zpe.thermalcorrener: 0.150828 hartree
zpe.thermalcorrenthalpy: 0.151772 hartree
zpe.thermalcorrgfe: 0.100616 hartree
zpe.sumelectzpe: -890.616940 hartree
zpe.sumelectthermal: -890.605361 hartree
zpe.sumelectthermalent: -890.604417 hartree
zpe.sumelectthermalfe: -890.655573 hartree
dipole: -3.4112 -1.4717 -1.1706
dipole: 3.8952
quadrupole: -71.2964 -77.8101 -70.1853
quadrupole: -0.2402 -4.0584 2.7474
quadrupole: 1.8009 -4.7128 2.9119 -0.2402 -4.0584 2.7474
hfenergy: -890.7561898 hartree
pointgroup: C01 [X(C6H8N2O2S1)]
dipole: 1.3551077 -0.3764759 0.6086765 debye
dipolederiv: -0.7920966 0.0809053 -0.056929 -0.1295204 -0.0670993 -0.009499 -0.0335389 0.003073 -0.0801837 -0.7461304 -0.1034567 0.1610895 -0.203564 -0.5619391 0.1777971 0.2433917 0.2075653 -0.230838 -0.8165026 0.3308955 -0.0833585 0.5602749 -0.9998669 0.139323 -0.1150686 0.1184406 -0.3976433 -1.1204395 0.4480801 -0.1216237 0.007022 -0.4127578 0.0349075 -0.0696054 0.0599791 -0.2356602 -1.2984403 -0.0131354 -0.0684602 -0.9746274 -0.6486062 -0.0003231 0.0817215 0.0754727 -0.2041456 -0.1579596 -0.005875 0.0349414 0.4756502 -0.632432 0.1406101 0.0240881 0.1025203 -0.1096412 1.1787561 -0.4839545 0.1581346 -0.7054808 1.1785909 -0.2064583 0.2169951 -0.1820934 0.2551589 0.4131329 0.126006 -0.1091 0.2615963 0.473228 -0.1157123 -0.2600464 -0.1583403 0.3356802 0.9036872 -0.129678 0.0886814 0.101237 0.3990523 -0.0472481 0.001712 -0.0676555 -0.0510687 1.5609905 -0.0773724 0.1066308 0.8002156 0.669699 -0.0381973 -0.0185402 -0.1032272 0.0608346 0.1226857 -0.1143683 0.0206068 -0.1520776 0.1414384 -0.0208626 0.0294443 -0.0180849 0.0535427 -0.0056767 -0.0294565 -0.0445994 -0.0971707 0.0616326 -0.0051155 -0.0362706 0.0215728 -0.0662908 -0.0011311 0.0142168 0.0540135 0.0634524 -0.0840385 -0.0345693 0.0704627 -0.0458083 0.0483836 0.1651983 -0.0151679 -0.0082026 -0.0269696 0.1911888 0.0188167 -0.0102187 0.0209994 0.3256118 0.0914288 -0.0300721 0.0009558 -0.077808 -0.0089833 0.016538 0.0021647 0.0207184 0.1392985 0.1106818 -0.017711 -0.044336 0.062371 -0.0291401 -0.0647242 -0.0416268 -0.045374 0.0017239 0.0989421 -0.0107919 0.0659416 0.0611054 0.0030824 0.0741444 0.041096 0.0443581 -0.0159976 -0.1105161 0.0026328 -0.0187423 -0.0146458 0.0801773 0.0053902 -0.0155838 0.0066763 0.1312214 0.4033896 0.0283033 -0.1356439 -0.0110605 0.2467735 -0.0648172 -0.1105766 -0.0607925 0.0400135 unknown
polarizability: 159.3961767|-6.0258588|104.253119|7.9684569|-10.1215853|54.4107409 unknown
InChI: InChI=1S/C6H8N2O2S/c1-11-6-7-2-4(3-9)5(10)8-6/h2,8-9H,3H2,1H3
charge 0 multiplicity 1
19 atoms
S  3.215187 0.713809 -0.030891
O  -3.158263 -1.756139 0.28694
O  -1.58094 2.206862 -0.598042
N  0.579687 1.346608 -0.304389
N  1.029781 -0.962429 0.067967
C  -1.291214 -0.189112 -0.215765
C  -0.847056 1.194783 -0.39052
C  -2.782561 -0.45759 -0.284586
C  -0.346433 -1.182822 0.001745
C  1.44612 0.288128 -0.088201
C  3.937538 -0.997782 0.259515
H  -3.118321 -0.509939 -1.335139
H  -3.328357 0.384166 0.188722
H  0.928352 2.305556 -0.420309
H  -0.664192 -2.222291 0.126211
H  3.673182 -1.652158 -0.58165
H  3.536546 -1.407801 1.195838
H  5.025814 -0.84452 0.321957
H  -3.000274 -1.734429 1.265197
