program: Gaussian 09
title: 000295793
version: EM64L-G09RevD.01
frameworkgroup: C1[X(C15H16ClN3O2S)]
method: RPBEPBE
basis: SDD
operation: Freq
keyword: #p
keyword: freq=noraman
keyword: PBEPBE/SDD
title: #p freq=noraman PBEPBE/SDD
converged: YES YES NO NO
title: Mulliken charges:
elementType: Cl S O O N N N C C C C C C C C C C C C C C C H H H H H H H H H H H H H H H H
charge: -0.057751 0.292556 -0.280755 -0.315312 -0.377430 -0.021533 0.030820 -0.553950 0.529141 0.219811 0.032712 -0.441268 -0.352606 -0.202959 -0.215800 -0.360091 0.223851 -0.107525 -0.410349 -0.221090 -0.671722 -0.827889 0.233376 0.267288 0.366328 0.237504 0.252302 0.256117 0.256436 0.283538 0.231412 0.230376 0.214322 0.232038 0.232079 0.276645 0.273156 0.246223
chargesum: 0.00000
title: Mulliken charges with hydrogens summed into heavy atoms:
elementType: Cl S O O N N N C C C C C C C C C C C C C C C
charge: -0.057751 0.292556 -0.280755 -0.315312 -0.011102 -0.021533 0.030820 -0.053286 0.529141 0.219811 0.032712 -0.203764 -0.100304 0.053158 0.040637 -0.076553 0.223851 -0.107525 -0.410349 0.240698 0.006717 -0.031866
polarizability: 2.84315401e+02 7.09278455e-01 2.63161520e+02 1.81232723e+01 -9.26197863e+00 1.63070299e+02
1716.lowfreq: -5.1097 -0.0016 -0.0008 -0.0006 3.8277 5.5741 9.9186 17.5529 21.7892
frequency: 9.6748 17.4891 21.7825 34.3325 45.0483 80.1114 82.6359 93.4135 94.0971 114.2999 126.0052 139.2728 158.8797 180.6987 203.9993 230.9266 243.6199 258.0907 280.9063 292.2665 310.2922 330.6034 349.1389 376.5606 394.4649 409.4596 431.6280 443.6391 481.6220 512.2964 563.0523 607.6372 627.1844 641.7359 654.0561 664.0915 706.2172 707.3774 716.9869 782.0240 785.7567 795.4292 797.5771 826.3619 829.2003 830.3628 841.2911 893.4681 947.8452 955.6097 967.7597 977.4916 989.4808 999.4535 1004.5882 1017.3305 1032.8167 1071.9942 1084.7513 1112.4131 1112.5311 1135.3699 1140.3562 1184.1345 1200.8205 1210.0851 1249.0474 1254.1766 1282.1943 1296.4850 1306.2195 1336.5837 1338.9285 1358.5496 1371.5764 1381.4370 1398.9240 1401.4316 1412.5440 1432.4413 1435.6861 1451.9286 1463.6078 1464.8855 1472.9230 1479.8830 1486.1666 1528.3635 1580.2810 1590.8309 1594.0058 1602.8982 2994.3079 2997.3645 3012.8454 3021.8933 3054.8900 3072.0464 3093.9959 3109.8926 3127.6983 3143.8626 3146.2835 3151.0833 3165.8688 3168.8167 3172.0194 3332.8112
redmass: 7.2047 4.3491 3.7582 3.9012 3.2848 5.5816 4.3008 5.3649 4.5082 1.3001 2.3476 4.3828 6.4900 5.6889 4.1138 5.2709 1.4488 4.4736 4.9232 5.6942 5.7005 4.0298 8.6933 3.8696 6.4002 2.9235 3.6093 3.8189 5.2095 5.2081 6.7869 4.9200 6.3775 6.5815 7.9907 7.2618 6.8861 8.8894 4.1911 3.8469 6.0229 3.0366 1.1472 1.5910 1.8929 1.9595 1.4155 3.8853 1.3660 1.4482 1.3728 1.1806 1.3270 4.0747 3.4832 2.2623 3.9520 2.8461 5.0058 2.2378 1.3820 1.4637 5.2411 1.1163 3.0527 3.1431 1.1332 1.3456 1.8944 1.2695 6.7088 1.3483 1.5721 1.5908 2.1572 5.3030 2.2776 1.3229 2.4674 3.6699 1.0537 1.0861 1.0400 1.2466 1.0632 2.0520 1.0740 6.8198 4.9941 7.5142 3.2229 5.6369 1.0614 1.0359 1.0581 1.0282 1.0998 1.1067 1.0985 1.1028 1.0899 1.0890 1.1040 1.1055 1.0930 1.0953 1.0966 1.0807
irintensity: 0.3332 0.2651 0.0595 0.5297 1.6935 0.4828 1.1562 0.2682 0.7743 0.3432 2.6125 0.8441 0.9777 1.8638 4.9295 1.3638 0.7853 3.2889 5.2759 10.1282 1.5949 3.8304 13.7864 4.4607 28.0430 0.0733 5.9485 3.9858 33.0749 6.8838 10.5731 9.6817 2.5261 3.7597 6.4310 2.1337 3.0519 1.1121 5.9810 0.6922 4.2200 12.5711 4.9981 27.4747 44.1286 7.9455 117.4612 57.5342 0.0661 6.6890 0.1711 7.7021 6.4512 30.9893 10.8531 19.8291 135.1679 32.8798 165.5780 10.3521 6.2822 5.9537 664.7060 2.2831 43.2889 8.4715 0.0286 16.9308 362.8781 1.6562 0.5462 100.4964 12.7405 120.6115 99.0816 16.6083 45.0462 23.9220 102.8916 35.3535 15.6409 10.8674 12.5619 56.3739 7.1154 52.9532 7.9363 197.6762 668.4911 158.4530 311.8461 15.4902 45.3135 21.2300 19.7923 19.1682 10.9052 7.0478 28.7237 41.6462 10.9783 7.5238 12.2096 12.2114 2.5221 7.5349 0.2583 161.1349
temp: 298.150 k
press: 1.00000 atm
elementType: 17 16 8 8 7 7 7 6 6 6 6 6 6 6 6 6 6 6 6 6 6 6 1 1 1 1 1 1 1 1 1 1 1 1 1 1 1 1
symmnumber: 1
zpe: 753046.7 jmol-1
zpe.correction: 0.286820 hartree
zpe.thermalcorrener: 0.309020 hartree
zpe.thermalcorrenthalpy: 0.309964 hartree
zpe.thermalcorrgfe: 0.230480 hartree
zpe.sumelectzpe: -1752.438930 hartree
zpe.sumelectthermal: -1752.416730 hartree
zpe.sumelectthermalent: -1752.415786 hartree
zpe.sumelectthermalfe: -1752.495270 hartree
dipole: -0.2501 -1.7570 2.2256
dipole: 2.8466
quadrupole: -152.5208 -137.8649 -137.3324
quadrupole: 23.8590 5.6739 5.3789
quadrupole: -9.9481 4.7078 5.2403 23.8590 5.6739 5.3789
hfenergy: -1752.7257501 hartree
pointgroup: C01 [X(C15H16Cl1N3O2S1)]
dipole: 0.113012 -0.5898329 0.945278 debye
polarizability: 283.492347|7.7259085|262.7419282|15.7694494|-15.7151211|164.3129452 unknown
InChI: InChI=1S/C15H16ClN3O2S/c1-3-21-14(20)12-9-18-15(22-2)19-13(12)17-8-10-4-6-11(16)7-5-10/h4-7,9,17H,3,8H2,1-2H3
charge 0 multiplicity 1
38 atoms
Cl 6.480151 0.427485 -1.677745
S  -2.778554 3.667615 -1.078092
O  -2.858026 -2.906389 -0.016452
O  -0.774796 -2.532159 0.957858
N  0.125069 0.026503 0.991897
N  -1.26807 1.660659 0.018342
N  -3.427739 1.078776 -0.969232
C  1.149328 1.009364 1.373439
C  2.466595 0.831582 0.622284
C  -1.039179 0.343482 0.352997
C  -2.024559 -0.669504 0.024093
C  3.700679 0.874462 1.314486
C  2.477691 0.657417 -0.785121
C  4.929272 0.755402 0.624392
C  3.692904 0.534293 -1.491929
C  -3.195221 -0.217756 -0.639066
C  -1.8084 -2.079459 0.367533
C  4.903339 0.587534 -0.772249
C  -2.426843 1.953866 -0.611326
C  -2.70336 -4.360643 0.302893
C  -3.955684 -5.05697 -0.217846
C  -1.236207 4.533167 -0.441803
H  1.330649 0.939898 2.463117
H  0.72131 2.006383 1.165888
H  0.251057 -0.979431 1.198043
H  3.712553 0.999791 2.403993
H  1.530009 0.614982 -1.332956
H  5.881149 0.786842 1.162282
H  3.700446 0.400864 -2.577518
H  -3.970933 -0.939344 -0.910673
H  -1.779731 -4.724629 -0.181885
H  -2.582518 -4.462851 1.396376
H  -3.894949 -6.139501 -0.003546
H  -4.861577 -4.657429 0.268946
H  -4.057543 -4.924508 -1.308385
H  -0.345037 4.116878 -0.932099
H  -1.159872 4.405726 0.647185
H  -1.366607 5.594902 -0.703123
