program: Gaussian 09
title: 000295768
version: EM64L-G09RevD.01
frameworkgroup: C1[X(C7H8N4O2)]
method: RPBEPBE
basis: SDD
operation: Freq
keyword: #pfreq=noraman
keyword: PBEPBE/SDD
title: #p freq=noraman PBEPBE/SDD
converged: YES YES NO NO
title: Mulliken charges:
elementType: O O N N N N C C C C C C C H H H H H H H H
charge: -0.292996 -0.314085 -0.140181 0.012687 -0.641114 -0.594904 0.146182 0.061303 -0.005716 -0.351484 0.171918 0.196638 -0.734367 0.311140 0.235458 0.249842 0.249819 0.396440 0.327436 0.376663 0.339323
chargesum: 0.00000
title: Mulliken charges with hydrogens summed into heavy atoms:
elementType: O O N N N N C C C C C C C
charge: -0.292996 -0.314085 -0.140181 0.012687 0.082762 0.121082 0.146182 0.061303 -0.005716 -0.040344 0.171918 0.196638 0.000751
polarizability: 1.50694665e+02 -1.23150645e+00 1.27818447e+02 3.24405922e-02 -3.73472364e-02 4.98451061e+01
1716.lowfreq: -7.6684 -0.0007 -0.0006 -0.0003 2.8219 5.1064 29.8036 56.8555 65.0020
frequency: 29.7225 56.8384 64.9967 95.4312 163.1941 211.8197 277.1465 277.9866 310.2195 371.1832 374.9864 420.4675 440.0328 493.0172 545.8844 576.4873 627.1446 627.4564 640.3877 699.8218 718.9930 724.2220 733.6803 769.6511 819.0312 883.4132 933.0846 991.7565 1002.7162 1044.9855 1054.7694 1083.5150 1135.1388 1159.5970 1239.1967 1250.4180 1298.1745 1360.4868 1370.3997 1393.5572 1418.0049 1452.0926 1453.3384 1487.0447 1519.2020 1531.4996 1582.6859 1620.8584 1666.9878 3000.7154 3082.2088 3115.5074 3132.0134 3160.8266 3441.1790 3592.5065 3652.3188
redmass: 7.4184 1.0473 3.9067 7.6908 5.8987 3.7518 6.9103 5.2183 5.6776 6.4879 3.3450 3.7638 5.7085 3.0532 3.8220 4.1574 1.3643 5.1569 1.4503 4.9292 5.6517 3.7323 4.5013 1.1264 7.0285 5.3304 1.0709 1.4725 1.7018 8.2784 1.6253 2.1343 2.2368 3.0378 4.7102 4.2056 2.2995 3.0172 3.5283 1.3375 3.1619 1.3942 1.0464 2.6066 1.8603 4.8122 2.3245 5.0548 1.8921 1.0378 1.0966 1.0755 1.1002 1.0930 1.0505 1.0843 1.0988
irintensity: 0.0320 0.8534 0.4766 8.5148 0.8675 7.2397 16.3828 1.3643 4.2063 4.6797 27.1437 15.0090 8.4995 1.3482 20.4601 9.3700 175.1154 28.3570 28.7524 8.5093 3.6887 0.1327 76.4387 107.4376 2.9390 3.3079 178.8016 3.7088 4.4383 0.7916 15.6785 17.3694 2.2066 1.8973 2.1124 6.8467 21.1517 157.0995 102.9832 11.9811 90.4478 20.3759 16.1192 28.8855 127.3400 202.9814 418.9174 306.0847 39.0539 3.7125 7.7475 599.5597 16.0140 2.5726 72.3523 73.9791 108.6527
temp: 298.150 k
press: 1.00000 atm
elementType: 8 8 7 7 7 7 6 6 6 6 6 6 6 1 1 1 1 1 1 1 1
symmnumber: 1
zpe: 407807.0 jmol-1
zpe.correction: 0.155325 hartree
zpe.thermalcorrener: 0.167129 hartree
zpe.thermalcorrenthalpy: 0.168073 hartree
zpe.thermalcorrgfe: 0.116102 hartree
zpe.sumelectzpe: -640.095667 hartree
zpe.sumelectthermal: -640.083863 hartree
zpe.sumelectthermalent: -640.082919 hartree
zpe.sumelectthermalfe: -640.134890 hartree
dipole: -3.1645 4.4589 0.0006
dipole: 5.4677
quadrupole: -69.5791 -78.5817 -76.0568
quadrupole: -0.5962 0.0234 -0.0443
quadrupole: 5.1601 -3.8425 -1.3176 -0.5962 0.0234 -0.0443
hfenergy: -640.2509922 hartree
pointgroup: C01 [X(C7H8N4O2)]
dipole: 0.9509845 -1.9276678 -0.0853533 debye
dipolederiv: -0.6856741 0.2030305 -0.0183977 -0.016872 -1.0024962 -0.0675685 -0.0407162 -0.0399839 -0.3821263 -1.1130695 0.2582628 -0.0657898 -0.0175699 -0.814894 -0.0505225 -0.0947108 -0.0166769 -0.3734671 -0.8980755 0.1463158 -0.0727683 -0.2066921 -0.494054 -0.0589299 -0.1089049 -0.0147753 -0.2096145 -0.6626976 0.0240234 -0.0515901 0.3222943 -0.3512433 0.027569 -0.0181993 -0.0105909 -0.2335461 -0.9045202 -0.3294775 -0.0686036 -0.1341207 -0.8217459 -0.037973 -0.0490109 -0.0625572 -0.6392569 -0.6176495 0.1998902 0.0210708 0.3606236 -1.0592834 -0.0039844 0.0386436 -0.0239734 -0.614165 -0.3086236 -0.0955297 -0.0632835 0.0723465 -0.4506954 -0.0514042 -0.0465675 -0.0717169 0.0968666 0.1995102 -0.2007782 -0.0096682 -0.0367876 0.1905692 0.0055334 0.0081155 -0.0154052 0.0982235 1.1791993 -0.1551353 0.1197166 -0.139399 0.1953507 -0.0056011 0.1219021 -0.0085935 0.106617 0.2579452 0.1687254 0.0499271 -0.0334752 0.3392721 0.0329612 0.0269921 0.0579799 0.0169568 1.3247976 0.0395994 0.1474231 0.1087046 1.2265831 0.1202164 0.154809 0.1126221 0.2262252 1.2923911 -0.2725315 0.1049892 -0.1629322 1.2937242 0.0976144 0.1162242 0.0842796 0.2291011 -0.4374484 0.0651694 -0.0488455 -0.0684835 0.0759251 -0.0007705 -0.0662836 0.0166514 -0.0012344 0.1722197 0.0246499 0.0096787 0.008994 0.0695326 -0.0048781 0.0077755 -0.0021658 0.1213886 0.0899758 -0.0242501 -0.0066139 0.0774814 -0.0977185 -0.0153116 0.0052397 -0.028003 0.1182453 0.0342332 -0.0174031 0.0528811 -0.0042321 0.0623406 0.0892368 0.0952316 0.0633457 0.0254661 0.0680831 0.007655 -0.0386484 0.0360231 0.0934211 -0.0649952 -0.0756488 -0.0448103 -0.0399196 0.350094 -0.171349 -0.0202431 -0.2569118 0.7408193 0.0076272 -0.0292861 0.0179029 0.362383 0.2040317 0.0488215 -0.015793 0.0428263 0.1278425 -0.0192928 -0.0165659 -0.0184514 0.3623344 0.2866921 0.0927847 0.0021634 0.0814717 0.4122216 0.0170843 0.0007567 0.0187512 0.353349 0.1685855 -0.0124738 -0.0276048 -0.0332894 0.2645287 -0.0166109 -0.0297961 -0.013829 0.3761734 unknown
polarizability: 148.2177646|-5.9257301|127.9840371|11.7949878|7.6428656|52.1564159 unknown
InChI: InChI=1S/C7H8N4O2/c1-3-10-2-4(6(8)12)5(11-3)7(9)13/h2H,8-9H2,1H3
charge 0 multiplicity 1
21 atoms
O  -1.849069 2.785664 -0.13656
O  -2.035169 -1.774235 -0.636062
N  1.406044 -0.793212 -0.103002
N  1.968768 1.525807 0.223604
N  -2.859046 0.726448 -0.478433
N  -0.014745 -2.890407 -0.507475
C  -0.384608 0.860819 -0.148932
C  0.065805 -0.489725 -0.238087
C  2.308489 0.195922 0.118926
C  0.653584 1.820128 0.088593
C  -1.770205 1.51735 -0.257376
C  -0.768649 -1.753965 -0.477969
C  3.762668 -0.160469 0.262911
H  0.35509 2.87032 0.165839
H  3.912061 -1.24508 0.157765
H  4.360475 0.371333 -0.498516
H  4.138655 0.170993 1.24723
H  -2.76136 -0.308534 -0.572855
H  -3.761519 1.198359 -0.545266
H  0.996583 -2.781956 -0.370606
H  -0.467953 -3.789457 -0.659426
