program: Gaussian 09
title: 000295763
version: EM64L-G09RevD.01
frameworkgroup: C1[X(C5H7N3)]
method: RPBEPBE
basis: SDD
operation: Freq
keyword: #p
keyword: freq=noraman
keyword: PBEPBE/SDD
title: #p freq=noraman PBEPBE/SDD
converged: YES YES NO NO
title: Mulliken charges:
elementType: N N N C C C C C H H H H H H H
charge: -0.090942 -0.041179 -0.624554 0.036267 0.208558 -0.305162 -0.736961 -0.268322 0.223039 0.239948 0.237361 0.236325 0.239919 0.314736 0.330966
chargesum: 0.00000
title: Mulliken charges with hydrogens summed into heavy atoms:
elementType: N N N C C C C C
charge: -0.090942 -0.041179 0.021148 0.036267 0.208558 -0.082122 -0.023327 -0.028403
polarizability: 1.00602481e+02 3.12201109e+00 8.08574922e+01 1.54268226e-01 -7.26202095e-02 3.66131785e+01
1716.lowfreq: -13.4582 -7.1007 -0.0006 0.0004 0.0005 7.8281 14.2287 167.9219 208.0558
frequency: 10.4050 167.9217 208.0543 292.0136 414.9525 423.5745 431.3315 527.7466 537.3324 570.0754 626.9731 746.0406 768.4211 824.7724 911.9772 942.9889 963.1618 975.6590 1052.3777 1076.7381 1094.7204 1264.0778 1275.7581 1349.9957 1379.7353 1404.6865 1428.0647 1456.2244 1466.2991 1533.8075 1570.6579 1620.6105 2998.3342 3081.5417 3129.0156 3130.7236 3161.3755 3545.7924 3702.8298
redmass: 1.0352 3.7527 4.5265 2.6290 1.1846 2.5786 2.7041 1.1545 7.1364 5.4731 3.1121 5.8675 3.3484 1.6238 3.7576 4.0069 1.4131 1.7114 1.6208 2.0348 1.4592 2.6292 3.1624 2.1387 1.4774 2.5743 2.9550 1.0542 1.1996 5.2098 2.9587 1.5846 1.0376 1.0962 1.0899 1.0998 1.0977 1.0450 1.1045
irintensity: 0.9463 2.3708 11.0731 6.9086 199.7393 4.9198 4.4094 112.1392 2.8162 4.3664 3.4924 2.8870 0.1297 50.9395 11.3672 3.4835 0.0743 0.4694 9.9947 9.0471 1.0013 8.5079 17.4690 21.8531 5.1305 115.3522 84.2609 15.1568 16.7951 108.5685 149.0642 401.3987 9.5038 14.8775 22.3425 6.6465 23.2978 75.9932 35.5401
temp: 298.150 k
press: 1.00000 atm
elementType: 7 7 7 6 6 6 6 6 1 1 1 1 1 1 1
symmnumber: 1
zpe: 311428.4 jmol-1
zpe.correction: 0.118617 hartree
zpe.thermalcorrener: 0.126146 hartree
zpe.thermalcorrenthalpy: 0.127090 hartree
zpe.thermalcorrgfe: 0.085211 hartree
zpe.sumelectzpe: -358.405059 hartree
zpe.sumelectthermal: -358.397530 hartree
zpe.sumelectthermalent: -358.396586 hartree
zpe.sumelectthermalfe: -358.438466 hartree
dipole: -3.7410 -0.5246 0.0375
dipole: 3.7777
quadrupole: -36.6805 -45.1287 -49.7745
quadrupole: -1.6950 0.0205 -0.0229
quadrupole: 7.1808 -1.2674 -5.9133 -1.6950 0.0205 -0.0229
hfenergy: -358.5236763 hartree
pointgroup: C01 [X(C5H7N3)]
dipole: -1.4822055 -0.1098922 -0.0036898 debye
dipolederiv: -1.1235424 -0.2219343 -0.0291816 0.1001706 -0.413663 -0.0193522 0.0057004 -0.0169712 -0.2427041 -0.7300172 0.073325 0.0063594 0.375879 -0.8181255 -0.0565053 0.0373902 -0.059721 -0.2258605 -1.1322238 -0.5765758 -0.0623873 -0.6217371 -0.4895329 0.0221381 -0.0661137 0.0226102 -0.7317291 0.9930678 -0.1061262 0.0015304 -0.3128744 0.7336506 0.0649754 -0.0036978 0.0566799 0.0456795 1.4341655 0.5924008 0.0664291 0.7265106 0.6847543 0.0512202 0.0751401 0.0500828 0.2273391 -0.3832348 -0.1166319 -0.014228 -0.5303455 -0.440761 -0.0281255 -0.0552589 -0.0272595 -0.1847622 -0.3170183 0.203529 0.0137468 0.1139547 0.0005173 0.0019453 -0.0297624 0.021153 0.0251588 0.6588773 0.0278859 0.0051862 -0.04481 0.4463178 0.0505677 -0.0049547 0.05222 -0.0426543 -0.0754444 0.1054517 0.0103534 0.081343 0.0288609 -0.0160217 0.008197 -0.0162344 0.1819677 0.0883784 -0.0772267 -0.0161204 0.0130496 -0.0950801 -0.0430012 0.0073081 -0.0470341 0.109952 0.0266593 -0.0130853 0.0887465 -0.0259685 0.0533288 0.0756287 0.1207607 0.0362508 0.0038745 0.0438512 0.0237562 -0.079217 0.0311729 0.0850934 -0.0347166 -0.1052659 -0.0036795 -0.0566874 0.0983721 0.0010889 0.0002921 0.0167236 -0.1283076 -0.0259246 0.0019442 -0.0256095 0.119689 0.2218124 0.0470267 0.004869 0.02971 0.1398936 -0.0257594 0.0034968 -0.0258465 0.3893257 0.1962969 0.037116 0.0036216 0.0472215 0.2130534 -0.0170691 0.005116 -0.016641 0.3814112 unknown
polarizability: 100.9225018|1.7507691|80.0960994|0.6448015|4.366463|37.0545507 unknown
InChI: InChI=1S/C5H7N3/c1-4-7-3-2-5(6)8-4/h2-3H,6H2,1H3
charge 0 multiplicity 1
15 atoms
N  -0.087716 -0.965125 -0.098395
N  1.238982 1.067365 0.116899
N  -2.42245 -0.93403 -0.100855
C  1.098957 -0.291909 -0.02412
C  -1.243767 -0.223277 -0.025199
C  -1.202871 1.19631 0.124042
C  2.367724 -1.106073 -0.092958
C  0.071564 1.78256 0.189079
H  -2.11239 1.801085 0.18521
H  2.134228 -2.1600 -0.304516
H  3.037113 -0.702934 -0.872533
H  2.914406 -1.037844 0.865208
H  0.181453 2.86748 0.301443
H  -3.328298 -0.47679 -0.054971
H  -2.362733 -1.945418 -0.203233
